grant-n
type: LexicalEntry
canonical form: grant
sense: 00088243-n
part of speech: noun

subsidization-n
type: LexicalEntry
canonical form: subsidization
sense: 00088243-n
part of speech: noun
sense: 13406756-n

subsidisation-n
type: LexicalEntry
canonical form: subsidisation
sense: 00088243-n
part of speech: noun
sense: 13406756-n

00088243-n
type: LexicalConcept
in scheme: en-word.net
definition: the act of providing a subsidy
ili: i35864
lexfile: noun.act
part of speech: noun
hypernym: 01085569-n

13406756-n
type: LexicalConcept
in scheme: en-word.net
definition: money (or other benefits) obtained as a subsidy
ili: i107062
lexfile: noun.possession
part of speech: noun
hypernym: 13405730-n