struggler-n
type: LexicalEntry
canonical form: struggler
sense: 10684741-n
part of speech: noun

10684741-n
type: LexicalConcept
in scheme: en-word.net
definition: a person who struggles with difficulties or with great effort
ili: i93380
lexfile: noun.person
part of speech: noun
hypernym: 09786620-n