retaliate-v
type: LexicalEntry
canonical form: retaliate
sense: 01155631-v
part of speech: verb

strike back-v
type: LexicalEntry
canonical form: strike back
sense: 01155631-v
part of speech: verb

01155631-v
type: LexicalConcept
in scheme: en-word.net
definition: make a counterattack and return like for like, especially evil for evil
example: The Empire strikes back
example: The Giants struck back and won the opener
example: The Israeli army retaliated for the Hamas bombing
ili: i27390
lexfile: verb.competition
part of speech: verb
hypernym: 01126313-v