hit-n
type: LexicalEntry
canonical form: hit
sense: 00065324-n
part of speech: noun

smash-n
type: LexicalEntry
canonical form: smash
sense: 00065324-n
part of speech: noun

smasher-n
type: LexicalEntry
canonical form: smasher
sense: 00065324-n
part of speech: noun

strike-n
type: LexicalEntry
canonical form: strike
sense: 00065324-n
part of speech: noun
sense: 00110234-n
sense: 00188559-n
sense: 00979387-n
sense: 01246221-n
sense: 07424621-n

bang-n
type: LexicalEntry
canonical form: bang
sense: 00065324-n
part of speech: noun

00065324-n
type: LexicalConcept
in scheme: en-word.net
definition: a conspicuous success
example: that song was his first hit and marked the beginning of his career
example: that new Broadway show is a real smasher
example: the party went with a bang
ili: i35746
lexfile: noun.act
part of speech: noun
hypernym: 00064472-n

00110234-n
type: LexicalConcept
in scheme: en-word.net
definition:
  value: (baseball) a pitch that the batter swings at and misses, or that the batter hits into foul territory, or that the batter does not swing at but the umpire judges to be in the area over home plate and between the batter's knees and shoulders
example: this pitcher throws more strikes than balls
ili: i35982
lexfile: noun.act
part of speech: noun
hypernym: 00107092-n

strike-v
type: LexicalEntry
canonical form: strike
sense: 00143360-v
part of speech: verb
sense: 00637566-v
sense: 00925593-v
sense: 01126313-v
sense: 01211755-v
sense: 01212046-v
sense: 01230799-v
sense: 01238728-v
sense: 01310668-v
sense: 01368542-v
sense: 01412877-v
sense: 01552202-v
sense: 01642647-v
sense: 01661889-v
sense: 01678968-v
sense: 01771801-v
sense: 01986409-v
sense: 02108439-v
sense: 02113245-v
sense: 02291532-v
sense: 02417777-v
sense: 02532477-v
sense: 02618011-v

00143360-v
type: LexicalConcept
in scheme: en-word.net
definition: cause to form (an electric arc) between electrodes of an arc lamp
example: strike an arc
ili: i22433
lexfile: verb.change
part of speech: verb
hypernym: 00142011-v
similar: 01678968-v

ten-strike-n
type: LexicalEntry
canonical form: ten-strike
sense: 00188559-n
part of speech: noun

00188559-n
type: LexicalConcept
in scheme: en-word.net
definition: a score in tenpins: knocking down all ten with the first ball
example: he finished with three strikes in the tenth frame
ili: i36397
lexfile: noun.act
part of speech: noun
hypernym: 00187483-n

00637566-v
type: LexicalConcept
in scheme: en-word.net
definition: arrive at after reckoning, deliberating, and weighing
example: strike a balance
example: strike a bargain
ili: i24918
lexfile: verb.cognition
part of speech: verb
hypernym: 00636568-v

00925593-v
type: LexicalConcept
in scheme: en-word.net
definition: indicate (a certain time) by striking
example: The clock struck midnight
example: Just when I entered, the clock struck
ili: i26229
lexfile: verb.communication
part of speech: verb
hypernym: 00924838-v

00979387-n
type: LexicalConcept
in scheme: en-word.net
definition: an attack that is intended to seize or inflict damage on or destroy an objective
example: the strike was scheduled to begin at dawn
ili: i40518
lexfile: noun.act
part of speech: noun
hypernym: 00974725-n

hit-v
type: LexicalEntry
canonical form: hit
sense: 01126313-v
part of speech: verb
sense: 01211755-v
sense: 01212046-v
sense: 01238728-v
sense: 02108439-v
sense: 02113245-v

01126313-v
type: LexicalConcept
in scheme: en-word.net
definition: make a strategic, offensive, assault against an enemy, opponent, or a target
example: The Germans struck Poland on Sept. 1, 1939
example: We must strike the enemy's oil fields
example: in the fifth inning, the Giants struck, sending three runners home to win the game 5 to 2
ili: i27219
lexfile: verb.competition
part of speech: verb
hypernym: 01121587-v
similar: 01139564-v
similar: 01211755-v

01211755-v
type: LexicalConcept
in scheme: en-word.net
definition: affect or afflict suddenly, usually adversely
example: We were hit by really bad weather
example: He was stricken with cancer when he was still a teenager
example: The earthquake struck at midnight
ili: i27668
lexfile: verb.contact
part of speech: verb
hypernym: 00137133-v
similar: 01126313-v

01212046-v
type: LexicalConcept
in scheme: en-word.net
definition: produce by manipulating keys or strings of musical instruments
example: The pianist strikes a middle C
example: strike ‘z’ on the keyboard
ili: i27669
lexfile: verb.contact
part of speech: verb
hypernym: 01208838-v

01230799-v
type: LexicalConcept
in scheme: en-word.net
definition: pierce with force
example: The bullet struck her thigh
example: The icy wind struck through our coats
ili: i27763
lexfile: verb.contact
part of speech: verb
hypernym: 01230239-v

impinge on-v
type: LexicalEntry
canonical form: impinge on
sense: 01238728-v
part of speech: verb

run into-v
type: LexicalEntry
canonical form: run into
sense: 01238728-v
part of speech: verb

collide with-v
type: LexicalEntry
canonical form: collide with
sense: 01238728-v
part of speech: verb

01238728-v
type: LexicalConcept
in scheme: en-word.net
definition: hit against; come into sudden contact with
example: The car hit a tree
example: He struck the table with his elbow
ili: i27808
lexfile: verb.contact
part of speech: verb
hypernym: 01208838-v
similar: 01412877-v

work stoppage-n
type: LexicalEntry
canonical form: work stoppage
sense: 01246221-n
part of speech: noun

01246221-n
type: LexicalConcept
in scheme: en-word.net
definition: a group's refusal to work in protest against low pay or bad work conditions
example: the strike lasted more than a month before it was settled
ili: i41910
lexfile: noun.act
part of speech: noun
hypernym: 01244711-n

strickle-v
type: LexicalEntry
canonical form: strickle
sense: 01310668-v
part of speech: verb

01310668-v
type: LexicalConcept
in scheme: en-word.net
definition: smooth with a strickle
example: strickle the grain in the measure
ili: i28225
lexfile: verb.contact
part of speech: verb
entails: 01255535-v
hypernym: 01309802-v

seize-v
type: LexicalEntry
canonical form: seize
sense: 01368542-v
part of speech: verb

01368542-v
type: LexicalConcept
in scheme: en-word.net
definition: hook by a pull on the line
example: strike a fish
ili: i28532
lexfile: verb.contact
part of speech: verb
hypernym: 01368412-v

01412877-v
type: LexicalConcept
in scheme: en-word.net
definition: deliver a sharp blow, as with the hand, fist, or weapon
example: The teacher struck the child
example: the opponent refused to strike
example: The boxer struck the attacker dead
ili: i28778
lexfile: verb.contact
part of speech: verb
hypernym: 01208838-v
similar: 01238728-v

scratch-v
type: LexicalEntry
canonical form: scratch
sense: 01552202-v
part of speech: verb

expunge-v
type: LexicalEntry
canonical form: expunge
sense: 01552202-v
part of speech: verb

excise-v
type: LexicalEntry
canonical form: excise
sense: 01552202-v
part of speech: verb

01552202-v
type: LexicalConcept
in scheme: en-word.net
definition: remove by erasing or crossing out or as if by drawing a line
example: Please strike this remark from the record
example: scratch that remark
ili: i29479
lexfile: verb.contact
part of speech: verb
hypernym: 01551969-v

mint-v
type: LexicalEntry
canonical form: mint
sense: 01642647-v
part of speech: verb

coin-v
type: LexicalEntry
canonical form: coin
sense: 01642647-v
part of speech: verb

01642647-v
type: LexicalConcept
in scheme: en-word.net
definition: form by stamping, punching, or printing
example: strike coins
example: strike a medal
ili: i29936
lexfile: verb.creation
part of speech: verb
hypernym: 01656555-v

01661889-v
type: LexicalConcept
in scheme: en-word.net
definition: disassemble a temporary structure, such as a tent or a theatrical set
example: after the show, we'll have to strike the set and pack up
lexfile: verb.creation
part of speech: verb
hypernym: 01661660-v

01678968-v
type: LexicalConcept
in scheme: en-word.net
definition: produce by ignition or a blow
example: strike fire from the flintstone
example: strike a match
ili: i30119
lexfile: verb.creation
part of speech: verb
hypernym: 01620211-v
similar: 00143360-v

affect-v
type: LexicalEntry
canonical form: affect
sense: 01771801-v
part of speech: verb

impress-v
type: LexicalEntry
canonical form: impress
sense: 01771801-v
part of speech: verb

move-v
type: LexicalEntry
canonical form: move
sense: 01771801-v
part of speech: verb

01771801-v
type: LexicalConcept
in scheme: en-word.net
definition: have an emotional or cognitive impact upon
example: This child impressed me as unusually mature
example: This behavior struck me as odd
example: he was dumb-struck by the news
example: her comments struck a sour note
ili: i30577
lexfile: verb.emotion
part of speech: verb
causes: 01775456-v
hypernym: 00137133-v
similar: 02113245-v
similar: 01653541-v

assume-v
type: LexicalEntry
canonical form: assume
sense: 01986409-v
part of speech: verb

take-v
type: LexicalEntry
canonical form: take
sense: 01986409-v
part of speech: verb

take up-v
type: LexicalEntry
canonical form: take up
sense: 01986409-v
part of speech: verb

01986409-v
type: LexicalConcept
in scheme: en-word.net
definition: occupy or take on
example: He assumes the lotus position
example: She took her seat on the stage
example: We took our seats in the orchestra
example: She took up her position behind the tree
example: strike a pose
ili: i31647
lexfile: verb.motion
part of speech: verb
hypernym: 01835473-v
similar: 02399325-v

02108439-v
type: LexicalConcept
in scheme: en-word.net
definition: drive something violently into a location
example: he hit his fist on the table
example: she struck her head on the low ceiling
ili: i32284
lexfile: verb.motion
part of speech: verb
hypernym: 01854282-v

come to-v
type: LexicalEntry
canonical form: come to
sense: 02113245-v
part of speech: verb
sense: 02532477-v

02113245-v
type: LexicalConcept
in scheme: en-word.net
definition: cause to experience suddenly
example: Panic struck me
example: An interesting idea hit her
example: A thought came to me
example: The thought struck terror in our minds
example: They were struck with fear
ili: i32305
lexfile: verb.perception
part of speech: verb
hypernym: 00725311-v
similar: 01771801-v

fall upon-v
type: LexicalEntry
canonical form: fall upon
sense: 02291532-v
part of speech: verb

come upon-v
type: LexicalEntry
canonical form: come upon
sense: 02291532-v
part of speech: verb

light upon-v
type: LexicalEntry
canonical form: light upon
sense: 02291532-v
part of speech: verb

chance upon-v
type: LexicalEntry
canonical form: chance upon
sense: 02291532-v
part of speech: verb

come across-v
type: LexicalEntry
canonical form: come across
sense: 02291532-v
part of speech: verb

chance on-v
type: LexicalEntry
canonical form: chance on
sense: 02291532-v
part of speech: verb

happen upon-v
type: LexicalEntry
canonical form: happen upon
sense: 02291532-v
part of speech: verb

attain-v
type: LexicalEntry
canonical form: attain
sense: 02291532-v
part of speech: verb

discover-v
type: LexicalEntry
canonical form: discover
sense: 02291532-v
part of speech: verb

02291532-v
type: LexicalConcept
in scheme: en-word.net
definition: find unexpectedly
example: the archeologists chanced upon an old tomb
example: she struck a goldmine
example: The hikers finally struck the main path to the lake
ili: i33166
lexfile: verb.possession
part of speech: verb
hypernym: 02290474-v

walk out-v
type: LexicalEntry
canonical form: walk out
sense: 02417777-v
part of speech: verb

02417777-v
type: LexicalConcept
in scheme: en-word.net
definition: stop work in order to press demands
example: The auto workers are striking for higher wages
example: The employees walked out when their demand for better benefits was not met
ili: i33803
lexfile: verb.social
part of speech: verb
hypernym: 02527076-v

02532477-v
type: LexicalConcept
in scheme: en-word.net
definition: attain
example: The horse finally struck a pace
ili: i34340
lexfile: verb.social
part of speech: verb
hypernym: 02531751-v

fall-v
type: LexicalEntry
canonical form: fall
sense: 02618011-v
part of speech: verb

shine-v
type: LexicalEntry
canonical form: shine
sense: 02618011-v
part of speech: verb

02618011-v
type: LexicalConcept
in scheme: en-word.net
definition: touch or seem as if touching visually or audibly
example: Light fell on her face
example: The sun shone on the fields
example: The light struck the golden necklace
example: A strange sound struck my ears
ili: i34732
lexfile: verb.stative
part of speech: verb
hypernym: 00340744-v

rap-n
type: LexicalEntry
canonical form: rap
sense: 07424621-n
part of speech: noun

tap-n
type: LexicalEntry
canonical form: tap
sense: 07424621-n
part of speech: noun

07424621-n
type: LexicalConcept
in scheme: en-word.net
definition: a gentle blow
ili: i75650
lexfile: noun.event
part of speech: noun
hypernym: 07353281-n