sprout-v
type: LexicalEntry
canonical form: sprout
sense: 00095131-v
part of speech: verb

stock-v
type: LexicalEntry
canonical form: stock
sense: 00095131-v
part of speech: verb
sense: 02290237-v
sense: 02328055-v
sense: 02328282-v
sense: 02334574-v
sense: 02334729-v
sense: 02334879-v

00095131-v
type: LexicalConcept
in scheme: en-word.net
definition: put forth and grow sprouts or shoots
example: the plant sprouted early this year
ili: i22246
lexfile: verb.body
part of speech: verb
hypernym: 00094214-v

banal-a
type: LexicalEntry
canonical form: banal
sense: 01693210-s
part of speech: adjective

commonplace-a
type: LexicalEntry
canonical form: commonplace
sense: 01693210-s
part of speech: adjective

hackneyed-a
type: LexicalEntry
canonical form: hackneyed
sense: 01693210-s
part of speech: adjective

old-hat-a
type: LexicalEntry
canonical form: old-hat
sense: 01693210-s
part of speech: adjective

shopworn-a
type: LexicalEntry
canonical form: shopworn
sense: 01693210-s
part of speech: adjective

stock-a
type: LexicalEntry
canonical form: stock
sense: 01693210-s
part of speech: adjective
sense: 01966886-s
sense: 02304764-s

threadbare-a
type: LexicalEntry
canonical form: threadbare
sense: 01693210-s
part of speech: adjective

timeworn-a
type: LexicalEntry
canonical form: timeworn
sense: 01693210-s
part of speech: adjective

tired-a
type: LexicalEntry
canonical form: tired
sense: 01693210-s
part of speech: adjective

trite-a
type: LexicalEntry
canonical form: trite
sense: 01693210-s
part of speech: adjective

well-worn-a
type: LexicalEntry
canonical form: well-worn
sense: 01693210-s
part of speech: adjective

01693210-s
type: LexicalConcept
in scheme: en-word.net
definition: repeated too often; overfamiliar through overuse
example: his remarks were trite and commonplace
example: hackneyed phrases
example: a stock answer
example: repeating threadbare jokes
example: parroting some timeworn axiom
example: the trite metaphor ‘hard as nails’
ili: i9245
lexfile: adj.all
part of speech: adjective satellite
similar: https://en-word.net/synset/01692724-a

livestock-n
type: LexicalEntry
canonical form: livestock
sense: 01890115-n
part of speech: noun

stock-n
type: LexicalEntry
canonical form: stock
sense: 01890115-n
part of speech: noun
sense: 03820267-n
sense: 04328672-n
sense: 04328942-n
sense: 04329164-n
sense: 04329525-n
sense: 07600779-n
sense: 08118376-n
sense: 08118903-n
sense: 11912498-n
sense: 11913106-n
sense: 13147850-n
sense: 13151064-n
sense: 13354848-n
sense: 13388243-n
sense: 13438244-n
sense: 14462007-n

farm animal-n
type: LexicalEntry
canonical form: farm animal
sense: 01890115-n
part of speech: noun

01890115-n
type: LexicalConcept
in scheme: en-word.net
definition: any animals kept for use or profit
ili: i45231
lexfile: noun.animal
part of speech: noun
hypernym: 01889397-n

standard-a
type: LexicalEntry
canonical form: standard
sense: 01966886-s
part of speech: adjective

01966886-s
type: LexicalConcept
in scheme: en-word.net
definition: regularly and widely used or sold
example: a standard size
example: a stock item
ili: i10732
lexfile: adj.all
part of speech: adjective satellite
similar: https://en-word.net/synset/01966104-a

carry-v
type: LexicalEntry
canonical form: carry
sense: 02290237-v
part of speech: verb

stockpile-v
type: LexicalEntry
canonical form: stockpile
sense: 02290237-v
part of speech: verb

02290237-v
type: LexicalConcept
in scheme: en-word.net
definition: have on hand
example: Do you carry kerosene heaters?
ili: i33161
lexfile: verb.possession
part of speech: verb
hypernym: 02208144-v

02304764-s
type: LexicalConcept
in scheme: en-word.net
definition: routine
example: a stock answer
ili: i12715
lexfile: adj.all
part of speech: adjective satellite
similar: https://en-word.net/synset/02303673-a

02328055-v
type: LexicalConcept
in scheme: en-word.net
definition: provide or furnish with a stock of something
example: stock the larder with meat
ili: i33351
lexfile: verb.possession
part of speech: verb
hypernym: 02332196-v

buy in-v
type: LexicalEntry
canonical form: buy in
sense: 02328282-v
part of speech: verb

stock up-v
type: LexicalEntry
canonical form: stock up
sense: 02328282-v
part of speech: verb

02328282-v
type: LexicalConcept
in scheme: en-word.net
definition: amass so as to keep for future use or sale or for a particular occasion or use
example: let's stock coffee as long as prices are low
ili: i33352
lexfile: verb.possession
part of speech: verb
domain topic: 01092370-n
hypernym: 02332196-v

02334574-v
type: LexicalConcept
in scheme: en-word.net
definition: supply with livestock
example: stock a farm
ili: i33375
lexfile: verb.possession
part of speech: verb
domain topic: 00919042-n
hypernym: 02332196-v
similar: 02334729-v

02334729-v
type: LexicalConcept
in scheme: en-word.net
definition: supply with fish
example: stock a lake
ili: i33376
lexfile: verb.possession
part of speech: verb
domain topic: 00919042-n
hypernym: 02332196-v
similar: 02334574-v

02334879-v
type: LexicalConcept
in scheme: en-word.net
definition: equip with a stock
example: stock a rifle
ili: i33377
lexfile: verb.possession
part of speech: verb
hypernym: 02344409-v

neckcloth-n
type: LexicalEntry
canonical form: neckcloth
sense: 03820267-n
part of speech: noun

03820267-n
type: LexicalConcept
in scheme: en-word.net
definition: an ornamental white cravat
ili: i56540
lexfile: noun.artifact
part of speech: noun
hypernym: 03132736-n

inventory-n
type: LexicalEntry
canonical form: inventory
sense: 04328672-n
part of speech: noun

04328672-n
type: LexicalConcept
in scheme: en-word.net
definition: the merchandise that a shop has on hand
example: they carried a vast inventory of hardware
example: they stopped selling in exact sizes in order to reduce inventory
ili: i59595
lexfile: noun.artifact
part of speech: noun
hypernym: 03754377-n

04328942-n
type: LexicalConcept
in scheme: en-word.net
definition: the handle end of some implements or tools
example: he grabbed the cue by the stock
ili: i59596
lexfile: noun.artifact
part of speech: noun
hypernym: 03491080-n

gunstock-n
type: LexicalEntry
canonical form: gunstock
sense: 04329164-n
part of speech: noun

04329164-n
type: LexicalConcept
in scheme: en-word.net
definition: the handle of a handgun or the butt end of a rifle or shotgun or part of the support of a machine gun or artillery gun
example: the rifle had been fitted with a special stock
ili: i59597
lexfile: noun.artifact
part of speech: noun
hypernym: 03491080-n
hypernym: 04366676-n

04329525-n
type: LexicalConcept
in scheme: en-word.net
definition: lumber used in the construction of something
example: they will cut round stock to 1-inch diameter
ili: i59598
lexfile: noun.artifact
part of speech: noun
hypernym: 14967718-n

broth-n
type: LexicalEntry
canonical form: broth
sense: 07600779-n
part of speech: noun

07600779-n
type: LexicalConcept
in scheme: en-word.net
definition: liquid in which meat and vegetables are simmered; used as a basis for e.g. soups or sauces
example: she made gravy with a base of beef stock
ili: i76630
lexfile: noun.food
part of speech: noun
hypernym: 07598762-n

breed-n
type: LexicalEntry
canonical form: breed
sense: 08118376-n
part of speech: noun

strain-n
type: LexicalEntry
canonical form: strain
sense: 08118376-n
part of speech: noun

08118376-n
type: LexicalConcept
in scheme: en-word.net
definition: a special variety of domesticated animals within a species
example: he experimented on a particular breed of white rats
example: he created a new strain of sheep
ili: i79778
lexfile: noun.group
part of speech: noun
hypernym: 08118051-n
hypernym: 08010371-n

lineage-n
type: LexicalEntry
canonical form: lineage
sense: 08118903-n
part of speech: noun

line-n
type: LexicalEntry
canonical form: line
sense: 08118903-n
part of speech: noun

line of descent-n
type: LexicalEntry
canonical form: line of descent
sense: 08118903-n
part of speech: noun

descent-n
type: LexicalEntry
canonical form: descent
sense: 08118903-n
part of speech: noun

bloodline-n
type: LexicalEntry
canonical form: bloodline
sense: 08118903-n
part of speech: noun

blood line-n
type: LexicalEntry
canonical form: blood line
sense: 08118903-n
part of speech: noun

blood-n
type: LexicalEntry
canonical form: blood
sense: 08118903-n
part of speech: noun

pedigree-n
type: LexicalEntry
canonical form: pedigree
sense: 08118903-n
part of speech: noun

ancestry-n
type: LexicalEntry
canonical form: ancestry
sense: 08118903-n
part of speech: noun

origin-n
type: LexicalEntry
canonical form: origin
sense: 08118903-n
part of speech: noun

parentage-n
type: LexicalEntry
canonical form: parentage
sense: 08118903-n
part of speech: noun

stemma-n
type: LexicalEntry
canonical form: stemma
sense: 08118903-n
part of speech: noun

08118903-n
type: LexicalConcept
in scheme: en-word.net
definition: the hereditary derivation of an individual
example: his entire lineage has been warriors
ili: i79781
lexfile: noun.group
part of speech: noun
hypernym: 08119368-n

Malcolm stock-n
type: LexicalEntry
canonical form: Malcolm stock
sense: 11912498-n
part of speech: noun

11912498-n
type: LexicalConcept
in scheme: en-word.net
definition: any of various ornamental flowering plants of the genus Malcolmia
ili: i99744
lexfile: noun.plant
part of speech: noun
hypernym: 11690372-n

gillyflower-n
type: LexicalEntry
canonical form: gillyflower
sense: 11913106-n
part of speech: noun

11913106-n
type: LexicalConcept
in scheme: en-word.net
definition: any of several Old World plants cultivated for their brightly colored flowers
ili: i99747
lexfile: noun.plant
part of speech: noun
hypernym: 11690372-n

13147850-n
type: LexicalConcept
in scheme: en-word.net
definition: a plant or stem onto which a graft is made; especially a plant grown specifically to provide the root part of grafted plants
ili: i105628
lexfile: noun.plant
part of speech: noun
hypernym: 13107668-n

caudex-n
type: LexicalEntry
canonical form: caudex
sense: 13151064-n
part of speech: noun

13151064-n
type: LexicalConcept
in scheme: en-word.net
definition: persistent thickened stem of a herbaceous perennial plant
ili: i105646
lexfile: noun.plant
part of speech: noun
hypernym: 13149924-n

13354848-n
type: LexicalConcept
in scheme: en-word.net
definition: the capital raised by a corporation through the issue of shares entitling holders to an ownership interest (equity)
example: he owns a controlling share of the company's stock
ili: i106776
lexfile: noun.possession
part of speech: noun
hypernym: 13375435-n
mero part: 13363150-n

store-n
type: LexicalEntry
canonical form: store
sense: 13388243-n
part of speech: noun

fund-n
type: LexicalEntry
canonical form: fund
sense: 13388243-n
part of speech: noun

13388243-n
type: LexicalConcept
in scheme: en-word.net
definition: a supply of something available for future use
example: he brought back a large store of Cuban cigars
ili: i106954
lexfile: noun.possession
part of speech: noun
hypernym: 13387866-n

stock certificate-n
type: LexicalEntry
canonical form: stock certificate
sense: 13438244-n
part of speech: noun

13438244-n
type: LexicalConcept
in scheme: en-word.net
definition: a certificate documenting the shareholder's ownership in the corporation
example: the value of his stocks doubled during the past year
ili: i107249
lexfile: noun.possession
part of speech: noun
hypernym: 13437518-n

14462007-n
type: LexicalConcept
in scheme: en-word.net
definition: the reputation and popularity a person has
example: his stock was so high he could have been elected mayor
ili: i112883
lexfile: noun.state
part of speech: noun
hypernym: 14461591-n