perplex-v
type: LexicalEntry
canonical form: perplex
sense: 00624056-v
part of speech: verb

vex-v
type: LexicalEntry
canonical form: vex
sense: 00624056-v
part of speech: verb

stick-v
type: LexicalEntry
canonical form: stick
sense: 00624056-v
part of speech: verb
sense: 00750090-v
sense: 01223449-v
sense: 01359453-v
sense: 01444412-v
sense: 01444612-v
sense: 01530857-v
sense: 01617139-v
sense: 01617330-v
sense: 01617485-v
sense: 01671864-v
sense: 01861378-v
sense: 02644714-v
sense: 02644929-v
sense: 02653900-v
sense: 02759907-v

get-v
type: LexicalEntry
canonical form: get
sense: 00624056-v
part of speech: verb

puzzle-v
type: LexicalEntry
canonical form: puzzle
sense: 00624056-v
part of speech: verb

mystify-v
type: LexicalEntry
canonical form: mystify
sense: 00624056-v
part of speech: verb

baffle-v
type: LexicalEntry
canonical form: baffle
sense: 00624056-v
part of speech: verb

beat-v
type: LexicalEntry
canonical form: beat
sense: 00624056-v
part of speech: verb

pose-v
type: LexicalEntry
canonical form: pose
sense: 00624056-v
part of speech: verb

bewilder-v
type: LexicalEntry
canonical form: bewilder
sense: 00624056-v
part of speech: verb

flummox-v
type: LexicalEntry
canonical form: flummox
sense: 00624056-v
part of speech: verb

stupefy-v
type: LexicalEntry
canonical form: stupefy
sense: 00624056-v
part of speech: verb

nonplus-v
type: LexicalEntry
canonical form: nonplus
sense: 00624056-v
part of speech: verb

gravel-v
type: LexicalEntry
canonical form: gravel
sense: 00624056-v
part of speech: verb

amaze-v
type: LexicalEntry
canonical form: amaze
sense: 00624056-v
part of speech: verb

dumbfound-v
type: LexicalEntry
canonical form: dumbfound
sense: 00624056-v
part of speech: verb

00624056-v
type: LexicalConcept
in scheme: en-word.net
definition: be a mystery or bewildering to
example: This beats me!
example: Got me — I don't know the answer!
example: a vexing problem
example: This question really stuck me
ili: i24864
lexfile: verb.cognition
part of speech: verb
hypernym: 00623406-v

sting-v
type: LexicalEntry
canonical form: sting
sense: 00750090-v
part of speech: verb

00750090-v
type: LexicalConcept
in scheme: en-word.net
definition: saddle with something disagreeable or disadvantageous
example: They stuck me with the dinner bill
example: I was stung with a huge tax bill
ili: i25438
lexfile: verb.communication
part of speech: verb
hypernym: 00749422-v

stick-n
type: LexicalEntry
canonical form: stick
sense: 01165418-n
part of speech: noun
sense: 03606019-n
sense: 04324558-n
sense: 04324971-n
sense: 04325114-n
sense: 04325269-n
sense: 05569340-n
sense: 07864621-n
sense: 13186544-n

01165418-n
type: LexicalConcept
in scheme: en-word.net
definition: threat of a penalty
example: the policy so far is all stick and no carrot
ili: i41492
lexfile: noun.act
part of speech: noun
hypernym: 01162829-n

cling-v
type: LexicalEntry
canonical form: cling
sense: 01223449-v
part of speech: verb

cleave-v
type: LexicalEntry
canonical form: cleave
sense: 01223449-v
part of speech: verb

adhere-v
type: LexicalEntry
canonical form: adhere
sense: 01223449-v
part of speech: verb
sense: 01359453-v
sense: 02644714-v
sense: 02644929-v

cohere-v
type: LexicalEntry
canonical form: cohere
sense: 01223449-v
part of speech: verb

01223449-v
type: LexicalConcept
in scheme: en-word.net
definition: come or be in close contact with; stick or hold together and resist separation
example: The dress clings to her body
example: The label stuck to the box
example: The sushi rice grains cohere
ili: i27727
lexfile: verb.contact
part of speech: verb
entails: 01293025-v
hypernym: 01208316-v
similar: 01359453-v
similar: 01617485-v

hold fast-v
type: LexicalEntry
canonical form: hold fast
sense: 01359453-v
part of speech: verb

bond-v
type: LexicalEntry
canonical form: bond
sense: 01359453-v
part of speech: verb

bind-v
type: LexicalEntry
canonical form: bind
sense: 01359453-v
part of speech: verb

stick to-v
type: LexicalEntry
canonical form: stick to
sense: 01359453-v
part of speech: verb

01359453-v
type: LexicalConcept
in scheme: en-word.net
definition: stick to firmly
example: Will this wallpaper adhere to the wall?
ili: i28479
lexfile: verb.contact
part of speech: verb
hypernym: 01293025-v
similar: 01223449-v

01444412-v
type: LexicalConcept
in scheme: en-word.net
definition: pierce or penetrate or puncture with something pointed
example: He stuck the needle into his finger
ili: i28935
lexfile: verb.contact
part of speech: verb
hypernym: 01444129-v
similar: 01444612-v

01444612-v
type: LexicalConcept
in scheme: en-word.net
definition: pierce with a thrust using a pointed instrument
example: he stuck the cloth with the needle
ili: i28936
lexfile: verb.contact
part of speech: verb
hypernym: 01444129-v
similar: 01444412-v

lodge-v
type: LexicalEntry
canonical form: lodge
sense: 01530857-v
part of speech: verb

wedge-v
type: LexicalEntry
canonical form: wedge
sense: 01530857-v
part of speech: verb

deposit-v
type: LexicalEntry
canonical form: deposit
sense: 01530857-v
part of speech: verb

01530857-v
type: LexicalConcept
in scheme: en-word.net
definition: put, fix, force, or implant
example: lodge a bullet in the table
example: stick your thumb in the crack
ili: i29370
lexfile: verb.contact
part of speech: verb
hypernym: 01343121-v

01617139-v
type: LexicalConcept
in scheme: en-word.net
definition: fasten into place by fixing an end or point into something
example: stick the corner of the sheet under the mattress
ili: i29828
lexfile: verb.contact
part of speech: verb
hypernym: 01346574-v
similar: 01617485-v

01617330-v
type: LexicalConcept
in scheme: en-word.net
definition: fasten with or as with pins or nails
example: stick the photo onto the corkboard
ili: i29829
lexfile: verb.contact
part of speech: verb
hypernym: 01346574-v
similar: 01617485-v

01617485-v
type: LexicalConcept
in scheme: en-word.net
definition: fasten with an adhesive material like glue
example: stick the poster onto the wall
ili: i29830
lexfile: verb.contact
part of speech: verb
hypernym: 01346574-v
similar: 01223449-v
similar: 01617330-v
similar: 01617139-v

01671864-v
type: LexicalConcept
in scheme: en-word.net
definition: cover and decorate with objects that pierce the surface
example: stick some feathers in the turkey before you serve it
ili: i30075
lexfile: verb.creation
part of speech: verb
hypernym: 01679858-v

stay-v
type: LexicalEntry
canonical form: stay
sense: 01861378-v
part of speech: verb

stick around-v
type: LexicalEntry
canonical form: stick around
sense: 01861378-v
part of speech: verb

stay put-v
type: LexicalEntry
canonical form: stay put
sense: 01861378-v
part of speech: verb

remain-v
type: LexicalEntry
canonical form: remain
sense: 01861378-v
part of speech: verb

persist-v
type: LexicalEntry
canonical form: persist
sense: 01861378-v
part of speech: verb

01861378-v
type: LexicalConcept
in scheme: en-word.net
definition: be in a certain place and not leave
example: We are staying in Detroit; we are not moving to Cincinnati
example: Stay put in the corner here!
example: Stick around and you will learn something!
ili: i30988
lexfile: verb.motion
part of speech: verb
hypernym: 01852297-v

stand by-v
type: LexicalEntry
canonical form: stand by
sense: 02644714-v
part of speech: verb

stick by-v
type: LexicalEntry
canonical form: stick by
sense: 02644714-v
part of speech: verb

02644714-v
type: LexicalConcept
in scheme: en-word.net
definition: be loyal to
example: She stood by her husband in times of trouble
example: The friends stuck together through the war
ili: i34864
lexfile: verb.stative
part of speech: verb
hypernym: 02463535-v

02644929-v
type: LexicalConcept
in scheme: en-word.net
definition: be a devoted follower or supporter
example: The residents of this village adhered to Catholicism
example: She sticks to her principles
ili: i34865
lexfile: verb.stative
part of speech: verb
hypernym: 02351891-v

02653900-v
type: LexicalConcept
in scheme: en-word.net
definition: endure
example: The label stuck to her for the rest of her life
ili: i34906
lexfile: verb.stative
part of speech: verb
hypernym: 01861378-v

02759907-v
type: LexicalConcept
in scheme: en-word.net
definition: be or become fixed
example: The door sticks — we will have to plane it
ili: i35448
lexfile: verb.stative
part of speech: verb
hypernym: 02609706-v

joint-n
type: LexicalEntry
canonical form: joint
sense: 03606019-n
part of speech: noun

marijuana cigarette-n
type: LexicalEntry
canonical form: marijuana cigarette
sense: 03606019-n
part of speech: noun

reefer-n
type: LexicalEntry
canonical form: reefer
sense: 03606019-n
part of speech: noun

spliff-n
type: LexicalEntry
canonical form: spliff
sense: 03606019-n
part of speech: noun

03606019-n
type: LexicalConcept
in scheme: en-word.net
definition: marijuana leaves rolled into a cigarette for smoking
ili: i55280
lexfile: noun.artifact
part of speech: noun
hypernym: 03034648-n
mero substance: 02953127-n

04324558-n
type: LexicalConcept
in scheme: en-word.net
definition: an implement consisting of a length of wood
example: he collected dry sticks for a campfire
example: the kid had a candied apple on a stick
ili: i59571
lexfile: noun.artifact
part of speech: noun
hypernym: 03569147-n

04324971-n
type: LexicalConcept
in scheme: en-word.net
definition: a long thin implement resembling a length of wood
example: cinnamon sticks
example: a stick of dynamite
ili: i59572
lexfile: noun.artifact
part of speech: noun
hypernym: 03569147-n

control stick-n
type: LexicalEntry
canonical form: control stick
sense: 04325114-n
part of speech: noun

joystick-n
type: LexicalEntry
canonical form: joystick
sense: 04325114-n
part of speech: noun

04325114-n
type: LexicalConcept
in scheme: en-word.net
definition: a lever used by a pilot to control the ailerons and elevators of an airplane
ili: i59573
lexfile: noun.artifact
part of speech: noun
hypernym: 03664618-n

04325269-n
type: LexicalConcept
in scheme: en-word.net
definition: a long implement (usually made of wood) that is shaped so that hockey or polo players can hit a puck or ball
ili: i59574
lexfile: noun.artifact
part of speech: noun
domain topic: 00464604-n
domain topic: 00469063-n
domain topic: 00478650-n
hypernym: 04292284-n

pin-n
type: LexicalEntry
canonical form: pin
sense: 05569340-n
part of speech: noun

peg-n
type: LexicalEntry
canonical form: peg
sense: 05569340-n
part of speech: noun

05569340-n
type: LexicalConcept
in scheme: en-word.net
definition: informal terms for the leg
example: fever left him weak on his sticks
ili: i66140
lexfile: noun.body
part of speech: noun
hypernym: 05568420-n

07864621-n
type: LexicalConcept
in scheme: en-word.net
definition: a rectangular quarter pound block of butter or margarine
ili: i78415
lexfile: noun.food
part of speech: noun
hypernym: 07864314-n
hypernym: 07688659-n

13186544-n
type: LexicalConcept
in scheme: en-word.net
definition: a small thin branch of a tree
ili: i105857
lexfile: noun.plant
part of speech: noun
hypernym: 13184701-n