stemmer-n
type: LexicalEntry
canonical form: stemmer
sense: 04321005-n
part of speech: noun
sense: 04321124-n
sense: 05856280-n
sense: 10673342-n
sense: 10684095-n

04321005-n
type: LexicalConcept
in scheme: en-word.net
definition: a device for removing stems from fruit (as from grapes or apples)
ili: i59548
lexfile: noun.artifact
part of speech: noun
hypernym: 03187746-n

04321124-n
type: LexicalConcept
in scheme: en-word.net
definition: a miner's tamping bar for ramming packing in over a blasting charge
ili: i59549
lexfile: noun.artifact
part of speech: noun
hypernym: 04394793-n

stemming algorithm-n
type: LexicalEntry
canonical form: stemming algorithm
sense: 05856280-n
part of speech: noun

05856280-n
type: LexicalConcept
in scheme: en-word.net
definition: an algorithm for removing inflectional and derivational endings in order to reduce word forms to a common stem
ili: i67604
lexfile: noun.cognition
part of speech: noun
hypernym: 05855965-n

10673342-n
type: LexicalConcept
in scheme: en-word.net
definition: a worker who makes or applies stems for artificial flowers
ili: i93304
lexfile: noun.person
part of speech: noun
hypernym: 09655706-n

stripper-n
type: LexicalEntry
canonical form: stripper
sense: 10684095-n
part of speech: noun

sprigger-n
type: LexicalEntry
canonical form: sprigger
sense: 10684095-n
part of speech: noun

10684095-n
type: LexicalConcept
in scheme: en-word.net
definition: a worker who strips the stems from moistened tobacco leaves and binds the leaves together into books
ili: i93376
lexfile: noun.person
part of speech: noun
hypernym: 09655706-n