static-a
type: LexicalEntry
canonical form: static
sense: 00349120-s
part of speech: adjective

stable-a
type: LexicalEntry
canonical form: stable
sense: 00349120-s
part of speech: adjective
sense: 00897844-s
sense: 01936816-s
sense: 02281838-s
sense: https://en-word.net/lemma/stable-a#02298730-a

unchanging-a
type: LexicalEntry
canonical form: unchanging
sense: 00349120-s
part of speech: adjective

00349120-s
type: LexicalConcept
in scheme: en-word.net
definition: showing little if any change
example: a static population
ili: i1930
lexfile: adj.all
part of speech: adjective satellite
similar: https://en-word.net/synset/00348093-a

00897844-s
type: LexicalConcept
in scheme: en-word.net
definition: maintaining equilibrium
ili: i4905
lexfile: adj.all
part of speech: adjective satellite
similar: https://en-word.net/synset/00896734-a

01936816-s
type: LexicalConcept
in scheme: en-word.net
definition: not taking part readily in chemical change
ili: i10586
lexfile: adj.all
part of speech: adjective satellite
similar: https://en-word.net/synset/01935999-a

02281838-s
type: LexicalConcept
in scheme: en-word.net
definition: firm and dependable; subject to little fluctuation
example: the economy is stable
ili: i12582
lexfile: adj.all
part of speech: adjective satellite
similar: https://en-word.net/synset/02281076-a

https://en-word.net/synset/02298730-a
type: LexicalConcept
in scheme: en-word.net
definition: resistant to change of position or condition
example: a stable ladder
example: a stable peace
example: a stable relationship
example: stable prices
ili: i12682
lexfile: adj.all
part of speech: adjective
also: https://en-word.net/synset/00585590-a
also: https://en-word.net/synset/01758923-a
also: https://en-word.net/synset/02309241-a
similar: 02299068-s
similar: 02299232-s
similar: 02299364-s
similar: 02299486-s

stable-v
type: LexicalEntry
canonical form: stable
sense: 02465338-v
part of speech: verb

02465338-v
type: LexicalConcept
in scheme: en-word.net
definition: shelter in a stable
example: stable horses
ili: i34019
lexfile: verb.social
part of speech: verb
domain topic: 00919042-n
hypernym: 02662486-v

stable-n
type: LexicalEntry
canonical form: stable
sense: 04302017-n
part of speech: noun

stalls-n
type: LexicalEntry
canonical form: stalls
sense: 04302017-n
part of speech: noun

horse barn-n
type: LexicalEntry
canonical form: horse barn
sense: 04302017-n
part of speech: noun

04302017-n
type: LexicalConcept
in scheme: en-word.net
definition: a farm building for housing horses or other livestock
ili: i59431
lexfile: noun.artifact
part of speech: noun
hypernym: 03327515-n
mero part: 04306508-n