squint-v
type: LexicalEntry
canonical form: squint
sense: 00008595-v
part of speech: verb
sense: 00008792-v
sense: 02172514-v

squinch-v
type: LexicalEntry
canonical form: squinch
sense: 00008595-v
part of speech: verb

00008595-v
type: LexicalConcept
in scheme: en-word.net
definition: cross one's eyes as if in strabismus
example: The children squinted so as to scare each other
ili: i21810
lexfile: verb.body
part of speech: verb
hypernym: 00034281-v

00008792-v
type: LexicalConcept
in scheme: en-word.net
definition: partly close one's eyes, as when hit by direct blinding light
example: The driver squinted as the sun hit his windshield
ili: i21811
lexfile: verb.body
part of speech: verb
hypernym: 00033592-v
hypernym: 02169748-v

askance-a
type: LexicalEntry
canonical form: askance
sense: 00766264-s
part of speech: adjective

askant-a
type: LexicalEntry
canonical form: askant
sense: 00766264-s
part of speech: adjective

asquint-a
type: LexicalEntry
canonical form: asquint
sense: 00766264-s
part of speech: adjective

squint-a
type: LexicalEntry
canonical form: squint
sense: 00766264-s
part of speech: adjective

squint-eyed-a
type: LexicalEntry
canonical form: squint-eyed
sense: 00766264-s
part of speech: adjective

squinty-a
type: LexicalEntry
canonical form: squinty
sense: 00766264-s
part of speech: adjective

sidelong-a
type: LexicalEntry
canonical form: sidelong
sense: 00766264-s
part of speech: adjective

00766264-s
type: LexicalConcept
in scheme: en-word.net
definition: (used especially of glances) directed to one side with or as if with doubt or suspicion or envy
example: her eyes with their misted askance look
  source: Elizabeth Bowen
example: sidelong glances
ili: i4214
lexfile: adj.all
part of speech: adjective satellite
similar: https://en-word.net/synset/00765898-a

squint-n
type: LexicalEntry
canonical form: squint
sense: 00880006-n
part of speech: noun
sense: 14581007-n

00880006-n
type: LexicalConcept
in scheme: en-word.net
definition: the act of squinting; looking with the eyes partly closed
ili: i40010
lexfile: noun.act
part of speech: noun
hypernym: 00878805-n

02172514-v
type: LexicalConcept
in scheme: en-word.net
definition: be cross-eyed; have a squint or strabismus
ili: i32594
lexfile: verb.perception
part of speech: verb
hypernym: 02134989-v

strabismus-n
type: LexicalEntry
canonical form: strabismus
sense: 14581007-n
part of speech: noun

14581007-n
type: LexicalConcept
in scheme: en-word.net
definition: abnormal alignment of one or both eyes
ili: i113507
lexfile: noun.state
part of speech: noun
hypernym: 14525310-n