police squad-n
type: LexicalEntry
canonical form: police squad
sense: 08097824-n
part of speech: noun

squad-n
type: LexicalEntry
canonical form: squad
sense: 08097824-n
part of speech: noun
sense: 08225481-n
sense: 08235043-n

08097824-n
type: LexicalConcept
in scheme: en-word.net
definition: a small squad of policemen trained to deal with a particular kind of crime
ili: i79685
lexfile: noun.group
part of speech: noun
hypernym: 08225481-n

team-n
type: LexicalEntry
canonical form: team
sense: 08225481-n
part of speech: noun

08225481-n
type: LexicalConcept
in scheme: en-word.net
definition: a cooperative unit (especially in sports)
ili: i80236
lexfile: noun.group
part of speech: noun
hypernym: 08206589-n
mero member: 10681601-n
mero part: 08226440-n

08235043-n
type: LexicalConcept
in scheme: en-word.net
definition: a smallest army unit
ili: i80291
lexfile: noun.group
part of speech: noun
hypernym: 08207684-n