spread-n
type: LexicalEntry
canonical form: spread
sense: 00368802-n
part of speech: noun
sense: 02825355-n
sense: 04059554-n
sense: 04760114-n
sense: 05095531-n
sense: 05108774-n
sense: 06268608-n
sense: 07460496-n
sense: 07593658-n
sense: 07872246-n

spreading-n
type: LexicalEntry
canonical form: spreading
sense: 00368802-n
part of speech: noun
sense: 07460496-n

00368802-n
type: LexicalConcept
in scheme: en-word.net
definition: act of extending over a wider scope or expanse of space or time
ili: i37346
lexfile: noun.act
part of speech: noun
hypernym: 00368594-n

dispersed-a
type: LexicalEntry
canonical form: dispersed
sense: 00543197-s
part of speech: adjective

spread-a
type: LexicalEntry
canonical form: spread
sense: 00543197-s
part of speech: adjective
sense: 01434811-s
sense: 01850782-s

00543197-s
type: LexicalConcept
in scheme: en-word.net
definition: distributed or spread over a considerable extent
example: has ties with many widely dispersed friends
example: eleven million Jews are spread throughout Europe
ili: i3029
lexfile: adj.all
part of speech: adjective satellite
similar: https://en-word.net/synset/00542013-a

circulate-v
type: LexicalEntry
canonical form: circulate
sense: 00970243-v
part of speech: verb
sense: 00971905-v

circularize-v
type: LexicalEntry
canonical form: circularize
sense: 00970243-v
part of speech: verb

circularise-v
type: LexicalEntry
canonical form: circularise
sense: 00970243-v
part of speech: verb

distribute-v
type: LexicalEntry
canonical form: distribute
sense: 00970243-v
part of speech: verb
sense: 01381221-v

disseminate-v
type: LexicalEntry
canonical form: disseminate
sense: 00970243-v
part of speech: verb

propagate-v
type: LexicalEntry
canonical form: propagate
sense: 00970243-v
part of speech: verb
sense: 01382787-v

broadcast-v
type: LexicalEntry
canonical form: broadcast
sense: 00970243-v
part of speech: verb

spread-v
type: LexicalEntry
canonical form: spread
sense: 00970243-v
part of speech: verb
sense: 00971905-v
sense: 01381221-v
sense: 01382787-v
sense: 01582662-v
sense: 01614650-v
sense: 01614805-v
sense: 02064069-v
sense: 02086937-v
sense: 02695141-v

diffuse-v
type: LexicalEntry
canonical form: diffuse
sense: 00970243-v
part of speech: verb
sense: 02064069-v

disperse-v
type: LexicalEntry
canonical form: disperse
sense: 00970243-v
part of speech: verb

pass around-v
type: LexicalEntry
canonical form: pass around
sense: 00970243-v
part of speech: verb

00970243-v
type: LexicalConcept
in scheme: en-word.net
definition: cause to become widely known
example: spread information
example: circulate a rumor
example: broadcast the news
ili: i26436
lexfile: verb.communication
part of speech: verb
causes: 00971905-v
hypernym: 00956640-v
similar: 00971905-v

go around-v
type: LexicalEntry
canonical form: go around
sense: 00971905-v
part of speech: verb

00971905-v
type: LexicalConcept
in scheme: en-word.net
definition: become widely known and passed on
example: the rumor spread
example: the story went around in the office
ili: i26443
lexfile: verb.communication
part of speech: verb
hypernym: 01839438-v
similar: 00970243-v

01381221-v
type: LexicalConcept
in scheme: en-word.net
definition: distribute or disperse widely
example: The invaders spread their language all over the country
ili: i28602
lexfile: verb.contact
part of speech: verb
hypernym: 01854282-v

01382787-v
type: LexicalConcept
in scheme: en-word.net
definition: become distributed or widespread
example: the infection spread
example: Optimism spread among the population
ili: i28609
lexfile: verb.contact
part of speech: verb
hypernym: 01835473-v

outspread-a
type: LexicalEntry
canonical form: outspread
sense: 01434811-s
part of speech: adjective

01434811-s
type: LexicalConcept
in scheme: en-word.net
definition: fully extended in width
example: outspread wings
example: with arms spread wide
ili: i7822
lexfile: adj.all
part of speech: adjective satellite
similar: https://en-word.net/synset/01434511-a

unfold-v
type: LexicalEntry
canonical form: unfold
sense: 01582662-v
part of speech: verb

spread out-v
type: LexicalEntry
canonical form: spread out
sense: 01582662-v
part of speech: verb
sense: 02064069-v
sense: 02086937-v

open-v
type: LexicalEntry
canonical form: open
sense: 01582662-v
part of speech: verb

01582662-v
type: LexicalConcept
in scheme: en-word.net
definition: spread out or open from a closed or folded state
example: open the map
example: spread your arms
ili: i29626
lexfile: verb.contact
part of speech: verb
hypernym: 01522610-v

01614650-v
type: LexicalConcept
in scheme: en-word.net
definition: distribute over a surface in a layer
example: spread cheese on a piece of bread
ili: i29814
lexfile: verb.contact
part of speech: verb
hypernym: 02047080-v

01614805-v
type: LexicalConcept
in scheme: en-word.net
definition: cover by spreading something over
example: spread the bread with cheese
ili: i29815
lexfile: verb.contact
part of speech: verb
hypernym: 01335412-v

01850782-s
type: LexicalConcept
in scheme: en-word.net
definition: prepared or arranged for a meal; especially having food set out
example: a table spread with food
ili: i10138
lexfile: adj.all
part of speech: adjective satellite
similar: https://en-word.net/synset/01849304-a

fan out-v
type: LexicalEntry
canonical form: fan out
sense: 02064069-v
part of speech: verb

02064069-v
type: LexicalConcept
in scheme: en-word.net
definition: move outward
example: The soldiers fanned out
ili: i32046
lexfile: verb.motion
part of speech: verb
hypernym: 01381221-v

scatter-v
type: LexicalEntry
canonical form: scatter
sense: 02086937-v
part of speech: verb

02086937-v
type: LexicalConcept
in scheme: en-word.net
definition: strew or distribute over an area
example: He spread fertilizer over the lawn
example: scatter cards across the table
ili: i32159
lexfile: verb.motion
part of speech: verb
hypernym: 02047080-v

overspread-v
type: LexicalEntry
canonical form: overspread
sense: 02695141-v
part of speech: verb

02695141-v
type: LexicalConcept
in scheme: en-word.net
definition: spread across or over
example: A big oil spot spread across the water
ili: i35100
lexfile: verb.stative
part of speech: verb
hypernym: 02693758-v

bedspread-n
type: LexicalEntry
canonical form: bedspread
sense: 02825355-n
part of speech: noun

bedcover-n
type: LexicalEntry
canonical form: bedcover
sense: 02825355-n
part of speech: noun

bed cover-n
type: LexicalEntry
canonical form: bed cover
sense: 02825355-n
part of speech: noun

bed covering-n
type: LexicalEntry
canonical form: bed covering
sense: 02825355-n
part of speech: noun

counterpane-n
type: LexicalEntry
canonical form: counterpane
sense: 02825355-n
part of speech: noun

02825355-n
type: LexicalConcept
in scheme: en-word.net
definition: decorative cover for a bed
ili: i50653
lexfile: noun.artifact
part of speech: noun
hypernym: 02823345-n

ranch-n
type: LexicalEntry
canonical form: ranch
sense: 04059554-n
part of speech: noun

cattle ranch-n
type: LexicalEntry
canonical form: cattle ranch
sense: 04059554-n
part of speech: noun

cattle farm-n
type: LexicalEntry
canonical form: cattle farm
sense: 04059554-n
part of speech: noun

04059554-n
type: LexicalConcept
in scheme: en-word.net
definition: farm consisting of a large tract of land along with facilities needed to raise livestock (especially cattle)
ili: i57952
lexfile: noun.artifact
part of speech: noun
hypernym: 03327044-n

gap-n
type: LexicalEntry
canonical form: gap
sense: 04760114-n
part of speech: noun

04760114-n
type: LexicalConcept
in scheme: en-word.net
definition: a conspicuous disparity or difference as between two figures
example: gap between income and outgo
example: the spread between lending and borrowing costs
ili: i62002
lexfile: noun.attribute
part of speech: noun
hypernym: 04759785-n

scatter-n
type: LexicalEntry
canonical form: scatter
sense: 05095531-n
part of speech: noun

05095531-n
type: LexicalConcept
in scheme: en-word.net
definition: a haphazard distribution in all directions
ili: i63736
lexfile: noun.attribute
part of speech: noun
hypernym: 05094504-n

05108774-n
type: LexicalConcept
in scheme: en-word.net
definition: the expansion of a person's girth (especially at middle age)
example: she exercised to avoid that middle-aged spread
ili: i63808
lexfile: noun.attribute
part of speech: noun
hypernym: 05108669-n

spread head-n
type: LexicalEntry
canonical form: spread head
sense: 06268608-n
part of speech: noun

spreadhead-n
type: LexicalEntry
canonical form: spreadhead
sense: 06268608-n
part of speech: noun

facing pages-n
type: LexicalEntry
canonical form: facing pages
sense: 06268608-n
part of speech: noun

06268608-n
type: LexicalConcept
in scheme: en-word.net
definition: two facing pages of a book or other publication
ili: i69392
lexfile: noun.communication
part of speech: noun
hypernym: 06267274-n

07460496-n
type: LexicalConcept
in scheme: en-word.net
definition: process or result of distributing or extending over a wide expanse of space
ili: i75840
lexfile: noun.event
part of speech: noun
hypernym: 07325733-n

banquet-n
type: LexicalEntry
canonical form: banquet
sense: 07593658-n
part of speech: noun

feast-n
type: LexicalEntry
canonical form: feast
sense: 07593658-n
part of speech: noun

07593658-n
type: LexicalConcept
in scheme: en-word.net
definition: a meal that is well prepared and greatly enjoyed
example: a banquet for the graduating seniors
example: the Thanksgiving feast
example: they put out quite a spread
ili: i76586
lexfile: noun.food
part of speech: noun
hypernym: 07589261-n

paste-n
type: LexicalEntry
canonical form: paste
sense: 07872246-n
part of speech: noun

07872246-n
type: LexicalConcept
in scheme: en-word.net
definition: a tasty mixture to be spread on bread or crackers or used in preparing other dishes
ili: i78475
lexfile: noun.food
part of speech: noun
hypernym: 07826883-n