spiritualize-v
type: LexicalEntry
canonical form: spiritualize
sense: 00477244-v
part of speech: verb
sense: 00581589-v
sense: 00625619-v

spiritualise-v
type: LexicalEntry
canonical form: spiritualise
sense: 00477244-v
part of speech: verb
sense: 00625619-v

00477244-v
type: LexicalConcept
in scheme: en-word.net
definition: purify from the corrupting influences of the world
example: During his stay at the ashram he was spiritualized
ili: i24093
lexfile: verb.change
part of speech: verb
hypernym: 00476750-v

transfigure-v
type: LexicalEntry
canonical form: transfigure
sense: 00581589-v
part of speech: verb

glorify-v
type: LexicalEntry
canonical form: glorify
sense: 00581589-v
part of speech: verb

00581589-v
type: LexicalConcept
in scheme: en-word.net
definition: elevate or idealize, in allusion to Christ's transfiguration
ili: i24657
lexfile: verb.change
part of speech: verb
hypernym: 00126072-v

00625619-v
type: LexicalConcept
in scheme: en-word.net
definition: give a spiritual meaning to; read in a spiritual sense
ili: i24869
lexfile: verb.cognition
part of speech: verb
hypernym: 00624823-v