soup-v
type: LexicalEntry
canonical form: soup
sense: 00084999-v
part of speech: verb

00084999-v
type: LexicalConcept
in scheme: en-word.net
definition: dope (a racehorse)
ili: i22196
lexfile: verb.body
part of speech: verb
domain topic: 00613447-n
hypernym: 00084799-v

soup-n
type: LexicalEntry
canonical form: soup
sense: 07598762-n
part of speech: noun
sense: 13950145-n
sense: 15073190-n

07598762-n
type: LexicalConcept
in scheme: en-word.net
definition: liquid food especially of meat or fish or vegetable stock often containing pieces of solid food
ili: i76617
lexfile: noun.food
part of speech: noun
hypernym: 07572999-n

13950145-n
type: LexicalConcept
in scheme: en-word.net
definition: an unfortunate situation
example: we're in the soup now
ili: i110134
lexfile: noun.state
part of speech: noun
exemplifies: 07089193-n
hypernym: 13948785-n

15073190-n
type: LexicalConcept
in scheme: en-word.net
definition: any composition having a consistency suggestive of soup
ili: i116252
lexfile: noun.substance
part of speech: noun
exemplifies: 07089193-n
hypernym: 14612672-n