solidify-v
type: LexicalEntry
canonical form: solidify
sense: 00446124-v
part of speech: verb
sense: 00446422-v

00446124-v
type: LexicalConcept
in scheme: en-word.net
definition: become solid
example: The metal solidified when it cooled
ili: i23946
lexfile: verb.change
part of speech: verb
domain topic: 06100457-n
hypernym: 00139943-v

00446422-v
type: LexicalConcept
in scheme: en-word.net
definition: make solid or more solid; cause to solidify
ili: i23947
lexfile: verb.change
part of speech: verb
causes: 00446124-v
domain topic: 06100457-n
hypernym: 00139943-v