solicitor-n
type: LexicalEntry
canonical form: solicitor
sense: 10642537-n
part of speech: noun
sense: 10642716-n

10642537-n
type: LexicalConcept
in scheme: en-word.net
definition: a British lawyer who gives legal advice and prepares legal documents
ili: i93137
lexfile: noun.person
part of speech: noun
domain topic: 08458195-n
hypernym: 10269647-n

canvasser-n
type: LexicalEntry
canonical form: canvasser
sense: 10642716-n
part of speech: noun

10642716-n
type: LexicalConcept
in scheme: en-word.net
definition: a petitioner who solicits contributions or trade or votes
ili: i93138
lexfile: noun.person
part of speech: noun
hypernym: 10439776-n