soldier-v
type: LexicalEntry
canonical form: soldier
sense: 01099442-v
part of speech: verb

01099442-v
type: LexicalConcept
in scheme: en-word.net
definition: serve as a soldier in the military
ili: i27077
lexfile: verb.competition
part of speech: verb
hypernym: 02714280-v

soldier-n
type: LexicalEntry
canonical form: soldier
sense: 02210299-n
part of speech: noun
sense: 10641415-n

02210299-n
type: LexicalConcept
in scheme: en-word.net
definition: a wingless sterile ant or termite having a large head and powerful jaws adapted for defending the colony
ili: i47090
lexfile: noun.animal
part of speech: noun
hypernym: 02210101-n

10641415-n
type: LexicalConcept
in scheme: en-word.net
definition: an enlisted man or woman who serves in an army
example: the soldiers stood at attention
ili: i93136
lexfile: noun.person
part of speech: noun
hypernym: 10078585-n