solar system-n
type: LexicalEntry
canonical form: solar system
sense: 09462337-n
part of speech: noun

09462337-n
type: LexicalConcept
in scheme: en-word.net
definition: the sun with the celestial bodies that revolve around it in its gravitational field
ili: i86215
lexfile: noun.object
part of speech: noun
hypernym: 08452398-n
mero member: 09350444-n
mero member: 09378520-n
mero member: 09404392-n
mero member: 09416900-n
mero member: 09293800-n
mero member: 09345360-n
mero member: 09370342-n
mero member: 09374305-n
mero member: 09391596-n
mero member: 09418792-n
mero member: 09447520-n
mero member: 09473312-n
mero member: 09490547-n
mero member: 09493892-n
mero part: 09337509-n