snore-v
type: LexicalEntry
canonical form: snore
sense: 00017024-v
part of speech: verb

saw wood-v
type: LexicalEntry
canonical form: saw wood
sense: 00017024-v
part of speech: verb

saw logs-v
type: LexicalEntry
canonical form: saw logs
sense: 00017024-v
part of speech: verb

00017024-v
type: LexicalConcept
in scheme: en-word.net
definition: breathe noisily during one's sleep
example: she complained that her husband snores
ili: i21852
lexfile: verb.body
part of speech: verb
entails: 00014735-v
hypernym: 00001740-v

snore-n
type: LexicalEntry
canonical form: snore
sense: 00837637-n
part of speech: noun
sense: 07409078-n

snoring-n
type: LexicalEntry
canonical form: snoring
sense: 00837637-n
part of speech: noun

stertor-n
type: LexicalEntry
canonical form: stertor
sense: 00837637-n
part of speech: noun

00837637-n
type: LexicalConcept
in scheme: en-word.net
definition: the act of snoring or producing a snoring sound
ili: i39795
lexfile: noun.act
part of speech: noun
hypernym: 00832852-n

07409078-n
type: LexicalConcept
in scheme: en-word.net
definition: the rattling noise produced when snoring
ili: i75555
lexfile: noun.event
part of speech: noun
hypernym: 07402109-n