sling-v
type: LexicalEntry
canonical form: sling
sense: 01516980-v
part of speech: verb
sense: 01604468-v
sense: 02109618-v
sense: 02109731-v

catapult-v
type: LexicalEntry
canonical form: catapult
sense: 01516980-v
part of speech: verb

01516980-v
type: LexicalConcept
in scheme: en-word.net
definition: hurl as if with a sling
ili: i29295
lexfile: verb.contact
part of speech: verb
hypernym: 01509775-v

01604468-v
type: LexicalConcept
in scheme: en-word.net
definition: hold or carry in a sling
example: he cannot button his shirt with his slinged arm
ili: i29751
lexfile: verb.contact
part of speech: verb
hypernym: 01604155-v

02109618-v
type: LexicalConcept
in scheme: en-word.net
definition: move with a sling
example: sling the cargo onto the ship
ili: i32290
lexfile: verb.motion
part of speech: verb
hypernym: 01854282-v

02109731-v
type: LexicalConcept
in scheme: en-word.net
definition: hang loosely or freely; let swing
ili: i32291
lexfile: verb.motion
part of speech: verb
hypernym: 01483990-v

sling-n
type: LexicalEntry
canonical form: sling
sense: 04246543-n
part of speech: noun
sense: 04246746-n
sense: 04246893-n
sense: 04247204-n
sense: 07933858-n

scarf bandage-n
type: LexicalEntry
canonical form: scarf bandage
sense: 04246543-n
part of speech: noun

triangular bandage-n
type: LexicalEntry
canonical form: triangular bandage
sense: 04246543-n
part of speech: noun

04246543-n
type: LexicalConcept
in scheme: en-word.net
definition: bandage to support an injured forearm; consisting of a wide triangular piece of cloth hanging from around the neck
ili: i59073
lexfile: noun.artifact
part of speech: noun
hypernym: 02788671-n

04246746-n
type: LexicalConcept
in scheme: en-word.net
definition: a simple weapon consisting of a looped strap in which a projectile is whirled and then released
ili: i59074
lexfile: noun.artifact
part of speech: noun
hypernym: 04572661-n

slingback-n
type: LexicalEntry
canonical form: slingback
sense: 04246893-n
part of speech: noun

04246893-n
type: LexicalConcept
in scheme: en-word.net
definition: a shoe that has a strap that wraps around the heel
ili: i59075
lexfile: noun.artifact
part of speech: noun
hypernym: 04206070-n

slingshot-n
type: LexicalEntry
canonical form: slingshot
sense: 04247204-n
part of speech: noun

catapult-n
type: LexicalEntry
canonical form: catapult
sense: 04247204-n
part of speech: noun

04247204-n
type: LexicalConcept
in scheme: en-word.net
definition: a plaything consisting of a Y-shaped stick with elastic between the arms; used to propel small stones
ili: i59077
lexfile: noun.artifact
part of speech: noun
hypernym: 03971038-n

07933858-n
type: LexicalConcept
in scheme: en-word.net
definition: a highball with liquor and water with sugar and lemon or lime juice
ili: i78891
lexfile: noun.food
part of speech: noun
hypernym: 07928451-n