sinuate-a
type: LexicalEntry
canonical form: sinuate
sense: 02252852-s
part of speech: adjective
sense: 02324670-s

02252852-s
type: LexicalConcept
in scheme: en-word.net
definition: having a strongly waved margin alternately concave and convex
ili: i12413
lexfile: adj.all
part of speech: adjective satellite
similar: https://en-word.net/synset/02252363-a

sinuous-a
type: LexicalEntry
canonical form: sinuous
sense: 02324670-s
part of speech: adjective

wiggly-a
type: LexicalEntry
canonical form: wiggly
sense: 02324670-s
part of speech: adjective

02324670-s
type: LexicalConcept
in scheme: en-word.net
definition: curved or curving in and out
example: wiggly lines
ili: i12831
lexfile: adj.all
part of speech: adjective satellite
similar: https://en-word.net/synset/02322682-a