simmer-v
type: LexicalEntry
canonical form: simmer
sense: 00325032-v
part of speech: verb

00325032-v
type: LexicalConcept
in scheme: en-word.net
definition: boil slowly at low temperature
example: simmer the sauce
example: simmering water
ili: i23353
lexfile: verb.change
part of speech: verb
domain topic: 00244785-n
hypernym: 00328938-v

simmer-n
type: LexicalEntry
canonical form: simmer
sense: 05021740-n
part of speech: noun

05021740-n
type: LexicalConcept
in scheme: en-word.net
definition: temperature just below the boiling point
example: the stew remained at a simmer for hours
ili: i63353
lexfile: noun.attribute
part of speech: noun
hypernym: 05018974-n