Yorktown-n
type: LexicalEntry
canonical form: Yorktown
sense: 01302733-n
part of speech: noun

siege of Yorktown-n
type: LexicalEntry
canonical form: siege of Yorktown
sense: 01302733-n
part of speech: noun

01302733-n
type: LexicalConcept
in scheme: en-word.net
definition: in 1781 the British under Cornwallis surrendered after a siege of three weeks by American and French troops; the surrender ended the American Revolution
ili: i42199
lexfile: noun.act
part of speech: noun
domain region: 09171719-n
instance hypernym: 01077041-n