shrug-v
type: LexicalEntry
canonical form: shrug
sense: 00033948-v
part of speech: verb

00033948-v
type: LexicalConcept
in scheme: en-word.net
definition: raise one's shoulders to indicate indifference or resignation
ili: i21935
lexfile: verb.body
part of speech: verb
hypernym: 00994073-v

shrug-n
type: LexicalEntry
canonical form: shrug
sense: 07288629-n
part of speech: noun

07288629-n
type: LexicalConcept
in scheme: en-word.net
definition: a gesture involving the shoulders
ili: i74913
lexfile: noun.communication
part of speech: noun
hypernym: 06889359-n