shrimp-v
type: LexicalEntry
canonical form: shrimp
sense: 01144496-v
part of speech: verb

01144496-v
type: LexicalConcept
in scheme: en-word.net
definition: fish for shrimp
ili: i27324
lexfile: verb.competition
part of speech: verb
hypernym: 01143220-v

shrimp-n
type: LexicalEntry
canonical form: shrimp
sense: 01989447-n
part of speech: noun
sense: 07810135-n
sense: 10563101-n

01989447-n
type: LexicalConcept
in scheme: en-word.net
definition: small slender-bodied chiefly marine decapod crustaceans with a long tail and single pair of pincers; many species are edible
ili: i45796
lexfile: noun.animal
part of speech: noun
hypernym: 01978787-n
mero part: 02588077-n
mero part: 07810135-n

prawn-n
type: LexicalEntry
canonical form: prawn
sense: 07810135-n
part of speech: noun

07810135-n
type: LexicalConcept
in scheme: en-word.net
definition: any of various edible decapod crustaceans
ili: i78058
lexfile: noun.food
part of speech: noun
hypernym: 07792842-n

runt-n
type: LexicalEntry
canonical form: runt
sense: 10563101-n
part of speech: noun

peewee-n
type: LexicalEntry
canonical form: peewee
sense: 10563101-n
part of speech: noun

half-pint-n
type: LexicalEntry
canonical form: half-pint
sense: 10563101-n
part of speech: noun

10563101-n
type: LexicalConcept
in scheme: en-word.net
definition: disparaging terms for small people
ili: i92664
lexfile: noun.person
part of speech: noun
hypernym: 10633021-n