shower-n-1
type: LexicalEntry
canonical form: shower
sense: 00258447-n
part of speech: noun

shower bath-n
type: LexicalEntry
canonical form: shower bath
sense: 00258447-n
part of speech: noun
sense: 04216680-n

00258447-n
type: LexicalConcept
in scheme: en-word.net
definition: washing yourself by standing upright under water sprayed from a nozzle
example: he took a shower after the game
ili: i36748
lexfile: noun.act
part of speech: noun
hypernym: 00256081-n

shower stall-n
type: LexicalEntry
canonical form: shower stall
sense: 04216680-n
part of speech: noun

04216680-n
type: LexicalConcept
in scheme: en-word.net
definition: booth for washing yourself, usually in a bathroom
ili: i58877
lexfile: noun.artifact
part of speech: noun
hypernym: 02877081-n
mero part: 04216003-n
mero part: 04216306-n