shirr-v
type: LexicalEntry
canonical form: shirr
sense: 00323196-v
part of speech: verb

00323196-v
type: LexicalConcept
in scheme: en-word.net
definition: bake (eggs) in their shells until they are set
example: shirr the eggs
ili: i23344
lexfile: verb.change
part of speech: verb
domain topic: 00244785-n
hypernym: 00320687-v