mollusk-n
type: LexicalEntry
canonical form: mollusk
sense: 01943377-n
part of speech: noun

mollusc-n
type: LexicalEntry
canonical form: mollusc
sense: 01943377-n
part of speech: noun

shellfish-n
type: LexicalEntry
canonical form: shellfish
sense: 01943377-n
part of speech: noun
sense: 07799186-n

01943377-n
type: LexicalConcept
in scheme: en-word.net
definition: invertebrate having a soft unsegmented body usually enclosed in a shell
ili: i45535
lexfile: noun.animal
part of speech: noun
hypernym: 01908302-n
mero part: 01906397-n
mero part: 07799186-n

07799186-n
type: LexicalConcept
in scheme: en-word.net
definition: meat of edible aquatic invertebrate with a shell (especially a mollusk or crustacean)
ili: i77986
lexfile: noun.food
part of speech: noun
hypernym: 07792842-n