shellac-v
type: LexicalEntry
canonical form: shellac
sense: 01273153-v
part of speech: verb

shellack-v
type: LexicalEntry
canonical form: shellack
sense: 01273153-v
part of speech: verb

01273153-v
type: LexicalConcept
in scheme: en-word.net
definition: cover with shellac
example: She wanted to shellac the desk to protect it from water spots
ili: i28009
lexfile: verb.contact
part of speech: verb
hypernym: 01271572-v

shellac-n
type: LexicalEntry
canonical form: shellac
sense: 04198193-n
part of speech: noun
sense: 14725789-n

shellac varnish-n
type: LexicalEntry
canonical form: shellac varnish
sense: 04198193-n
part of speech: noun

04198193-n
type: LexicalConcept
in scheme: en-word.net
definition: a thin varnish made by dissolving lac in ethanol; used to finish wood
ili: i58780
lexfile: noun.artifact
part of speech: noun
hypernym: 04529282-n
mero substance: 14725304-n

14725789-n
type: LexicalConcept
in scheme: en-word.net
definition: lac purified by heating and filtering; usually in thin orange or yellow flakes but sometimes bleached white
ili: i114251
lexfile: noun.substance
part of speech: noun
hypernym: 14725304-n
mero substance: 14726110-n