sextet-n
type: LexicalEntry
canonical form: sextet
sense: 07055648-n
part of speech: noun
sense: 08004131-n
sense: 08004811-n
sense: 08264737-n

sextette-n
type: LexicalEntry
canonical form: sextette
sense: 07055648-n
part of speech: noun
sense: 08004131-n
sense: 08004811-n
sense: 08264737-n

sestet-n
type: LexicalEntry
canonical form: sestet
sense: 07055648-n
part of speech: noun
sense: 08004811-n
sense: 08264737-n

07055648-n
type: LexicalConcept
in scheme: en-word.net
definition: a musical composition written for six performers
ili: i73665
lexfile: noun.communication
part of speech: noun
hypernym: 07051211-n

sixsome-n
type: LexicalEntry
canonical form: sixsome
sense: 08004131-n
part of speech: noun

08004131-n
type: LexicalConcept
in scheme: en-word.net
definition: six people considered as a unit
ili: i79260
lexfile: noun.group
part of speech: noun
hypernym: 07991473-n

08004811-n
type: LexicalConcept
in scheme: en-word.net
definition: a set of six similar things considered as a unit
ili: i79266
lexfile: noun.group
part of speech: noun
hypernym: 08013131-n

08264737-n
type: LexicalConcept
in scheme: en-word.net
definition: six performers or singers who perform together
ili: i80466
lexfile: noun.group
part of speech: noun
hypernym: 08263534-n