dress-v
type: LexicalEntry
canonical form: dress
sense: 00038562-v
part of speech: verb

arrange-v
type: LexicalEntry
canonical form: arrange
sense: 00038562-v
part of speech: verb
sense: 01709988-v

set-v
type: LexicalEntry
canonical form: set
sense: 00038562-v
part of speech: verb
sense: 00055930-v
sense: 00296959-v
sense: 00299337-v
sense: 00299677-v
sense: 00407168-v
sense: 00408773-v
sense: 00409010-v
sense: 00443624-v
sense: 00675367-v
sense: 00701581-v
sense: 00949109-v
sense: 01064417-v
sense: 01117424-v
sense: 01249886-v
sense: 01496967-v
sense: 01533061-v
sense: 01570056-v
sense: 01610349-v
sense: 01616143-v
sense: 01632091-v
sense: 01709988-v
sense: 01715608-v
sense: 01748696-v
sense: 01974660-v

do-v
type: LexicalEntry
canonical form: do
sense: 00038562-v
part of speech: verb

coif-v
type: LexicalEntry
canonical form: coif
sense: 00038562-v
part of speech: verb

coiffe-v
type: LexicalEntry
canonical form: coiffe
sense: 00038562-v
part of speech: verb

coiffure-v
type: LexicalEntry
canonical form: coiffure
sense: 00038562-v
part of speech: verb

00038562-v
type: LexicalConcept
in scheme: en-word.net
definition: arrange attractively
example: dress my hair for the wedding
ili: i21960
lexfile: verb.body
part of speech: verb
hypernym: 00040084-v
similar: 00045370-v

fructify-v
type: LexicalEntry
canonical form: fructify
sense: 00055930-v
part of speech: verb

00055930-v
type: LexicalConcept
in scheme: en-word.net
definition: produce fruit
example: the apple trees fructify
ili: i22053
lexfile: verb.body
part of speech: verb
hypernym: 00054856-v

adjust-v
type: LexicalEntry
canonical form: adjust
sense: 00296959-v
part of speech: verb

correct-v
type: LexicalEntry
canonical form: correct
sense: 00296959-v
part of speech: verb

00296959-v
type: LexicalConcept
in scheme: en-word.net
definition: alter or regulate so as to achieve accuracy or conform to a standard
example: Adjust the clock, please
example: correct the alignment of the front wheels
ili: i23208
lexfile: verb.change
part of speech: verb
hypernym: 00126072-v

00299337-v
type: LexicalConcept
in scheme: en-word.net
definition: set to a certain position or cause to operate correctly
example: set clocks or instruments
ili: i23219
lexfile: verb.change
part of speech: verb
hypernym: 00296959-v

00299677-v
type: LexicalConcept
in scheme: en-word.net
definition: put into a certain state; cause to be in a certain state
example: set the house afire
ili: i23221
lexfile: verb.change
part of speech: verb
hypernym: 00126072-v

fix-v
type: LexicalEntry
canonical form: fix
sense: 00407168-v
part of speech: verb
sense: 00949109-v

prepare-v
type: LexicalEntry
canonical form: prepare
sense: 00407168-v
part of speech: verb

set up-v
type: LexicalEntry
canonical form: set up
sense: 00407168-v
part of speech: verb
sense: 00408773-v
sense: 00409010-v

ready-v
type: LexicalEntry
canonical form: ready
sense: 00407168-v
part of speech: verb

gear up-v
type: LexicalEntry
canonical form: gear up
sense: 00407168-v
part of speech: verb

00407168-v
type: LexicalConcept
in scheme: en-word.net
definition: make ready or suitable or equip in advance for a particular purpose or for some use, event, etc
example: Get the children ready for school!
example: prepare for war
example: I was fixing to leave town after I paid the hotel bill
ili: i23758
lexfile: verb.change
part of speech: verb
hypernym: 00126072-v

lay out-v
type: LexicalEntry
canonical form: lay out
sense: 00408773-v
part of speech: verb

00408773-v
type: LexicalConcept
in scheme: en-word.net
definition: get ready for a particular purpose or event
example: set up an experiment
example: set the table
example: lay out the tools for the surgery
ili: i23764
lexfile: verb.change
part of speech: verb
hypernym: 00407168-v

rig-v
type: LexicalEntry
canonical form: rig
sense: 00409010-v
part of speech: verb

00409010-v
type: LexicalConcept
in scheme: en-word.net
definition: equip with sails or masts
example: rig a ship
ili: i23765
lexfile: verb.change
part of speech: verb
hypernym: 02344409-v

jell-v
type: LexicalEntry
canonical form: jell
sense: 00443624-v
part of speech: verb

congeal-v
type: LexicalEntry
canonical form: congeal
sense: 00443624-v
part of speech: verb

00443624-v
type: LexicalConcept
in scheme: en-word.net
definition: become gelatinous
example: the liquid jelled after we added the enzyme
ili: i23936
lexfile: verb.change
part of speech: verb
hypernym: 00446124-v

set-n
type: LexicalEntry
canonical form: set
sense: 00626939-n
part of speech: noun
sense: 01054777-n
sense: 04183589-n
sense: 04304614-n
sense: 05682428-n
sense: 06209437-n
sense: 07378145-n
sense: 08013131-n
sense: 08016141-n
sense: 08257090-n
sense: 13512263-n
sense: 15281228-n

exercise set-n
type: LexicalEntry
canonical form: exercise set
sense: 00626939-n
part of speech: noun

00626939-n
type: LexicalConcept
in scheme: en-word.net
definition: several exercises intended to be done in series
example: he did four sets of the incline bench press
ili: i38710
lexfile: noun.act
part of speech: noun
hypernym: 00625978-n

place-v
type: LexicalEntry
canonical form: place
sense: 00675367-v
part of speech: verb
sense: 01496967-v
sense: 01715608-v

put-v
type: LexicalEntry
canonical form: put
sense: 00675367-v
part of speech: verb
sense: 01496967-v

00675367-v
type: LexicalConcept
in scheme: en-word.net
definition: estimate
example: We put the time of arrival at 8 P.M.
ili: i25085
lexfile: verb.cognition
part of speech: verb
hypernym: 00674352-v

determine-v
type: LexicalEntry
canonical form: determine
sense: 00701581-v
part of speech: verb
sense: 00949109-v

00701581-v
type: LexicalConcept
in scheme: en-word.net
definition: fix conclusively or authoritatively
example: set the rules
ili: i25206
lexfile: verb.cognition
part of speech: verb
hypernym: 02372362-v

specify-v
type: LexicalEntry
canonical form: specify
sense: 00949109-v
part of speech: verb

define-v
type: LexicalEntry
canonical form: define
sense: 00949109-v
part of speech: verb

limit-v
type: LexicalEntry
canonical form: limit
sense: 00949109-v
part of speech: verb

00949109-v
type: LexicalConcept
in scheme: en-word.net
definition: decide upon or fix definitely
example: fix the variables
example: specify the parameters
ili: i26335
lexfile: verb.communication
part of speech: verb
hypernym: 00676526-v

01054777-n
type: LexicalConcept
in scheme: en-word.net
definition: the act of putting something in position
example: he gave a final set to his hat
ili: i40927
lexfile: noun.act
part of speech: noun
hypernym: 01053255-n

mark-v
type: LexicalEntry
canonical form: mark
sense: 01064417-v
part of speech: verb

01064417-v
type: LexicalConcept
in scheme: en-word.net
definition: establish as the highest level or best performance
example: set a record
ili: i26898
lexfile: verb.communication
part of speech: verb
hypernym: 00667394-v

sic-v
type: LexicalEntry
canonical form: sic
sense: 01117424-v
part of speech: verb

01117424-v
type: LexicalConcept
in scheme: en-word.net
definition: urge to attack someone
example: The owner sicked his dogs on the intruders
example: the shaman sics sorcerers on the evil spirits
ili: i27173
lexfile: verb.competition
part of speech: verb
hypernym: 01122487-v

hardened-a
type: LexicalEntry
canonical form: hardened
sense: 01155594-s
part of speech: adjective

set-a
type: LexicalEntry
canonical form: set
sense: 01155594-s
part of speech: adjective
sense: 01568996-s
sense: 01685966-s
sense: 01937602-s
sense: 02133811-s
sense: 02137288-s
sense: 02502978-s

01155594-s
type: LexicalConcept
in scheme: en-word.net
definition: converted to solid form (as concrete)
ili: i6300
lexfile: adj.all
part of speech: adjective satellite
similar: https://en-word.net/synset/01154418-a

01249886-v
type: LexicalConcept
in scheme: en-word.net
definition: give a fine, sharp edge to a knife or razor
ili: i27873
lexfile: verb.contact
part of speech: verb
hypernym: 01249745-v

pose-v
type: LexicalEntry
canonical form: pose
sense: 01496967-v
part of speech: verb

position-v
type: LexicalEntry
canonical form: position
sense: 01496967-v
part of speech: verb

lay-v
type: LexicalEntry
canonical form: lay
sense: 01496967-v
part of speech: verb

01496967-v
type: LexicalConcept
in scheme: en-word.net
definition: put into a certain place or abstract location
example: Put your things here
example: Set the tray down
example: Set the dogs on the scent of the missing children
example: Place emphasis on a certain point
ili: i29197
lexfile: verb.contact
part of speech: verb
hypernym: 01854282-v

countersink-v
type: LexicalEntry
canonical form: countersink
sense: 01533061-v
part of speech: verb

01533061-v
type: LexicalConcept
in scheme: en-word.net
definition: insert (a nail or screw below the surface, as into a countersink)
ili: i29382
lexfile: verb.contact
part of speech: verb
hypernym: 01532886-v

fixed-a
type: LexicalEntry
canonical form: fixed
sense: 01568996-s
part of speech: adjective

rigid-a
type: LexicalEntry
canonical form: rigid
sense: 01568996-s
part of speech: adjective

01568996-s
type: LexicalConcept
in scheme: en-word.net
definition: fixed and unmoving
example: with eyes set in a fixed glassy stare
example: his bearded face already has a set hollow look
  source: Connor Cruise O'Brien
example: a face rigid with pain
ili: i8588
lexfile: adj.all
part of speech: adjective satellite
similar: https://en-word.net/synset/01568466-a

plant-v
type: LexicalEntry
canonical form: plant
sense: 01570056-v
part of speech: verb

01570056-v
type: LexicalConcept
in scheme: en-word.net
definition: put or set (seeds, seedlings, or plants) into the ground
example: Let's plant flowers in the garden
ili: i29566
lexfile: verb.contact
part of speech: verb
hypernym: 01496967-v

01610349-v
type: LexicalConcept
in scheme: en-word.net
definition: fix in a border
example: The goldsmith set the diamond
ili: i29790
lexfile: verb.contact
part of speech: verb
hypernym: 01466592-v

01616143-v
type: LexicalConcept
in scheme: en-word.net
definition: put into a position that will restore a normal state
example: set a broken bone
ili: i29822
lexfile: verb.contact
part of speech: verb
hypernym: 01496967-v

01632091-v
type: LexicalConcept
in scheme: en-word.net
definition: apply or start
example: set fire to a building
ili: i29899
lexfile: verb.creation
part of speech: verb
hypernym: 01631641-v

laid-a
type: LexicalEntry
canonical form: laid
sense: 01685966-s
part of speech: adjective

01685966-s
type: LexicalConcept
in scheme: en-word.net
definition: set down according to a plan
example: a carefully laid table with places set for four people
example: stones laid in a pattern
ili: i9210
lexfile: adj.all
part of speech: adjective satellite
similar: https://en-word.net/synset/01685687-a

01709988-v
type: LexicalConcept
in scheme: en-word.net
definition: adapt for performance in a different way
example: set this poem to music
ili: i30276
lexfile: verb.creation
part of speech: verb
domain topic: 07034009-n
hypernym: 01709353-v

localize-v
type: LexicalEntry
canonical form: localize
sense: 01715608-v
part of speech: verb

localise-v
type: LexicalEntry
canonical form: localise
sense: 01715608-v
part of speech: verb

01715608-v
type: LexicalConcept
in scheme: en-word.net
definition: locate
example: The film is set in Africa
ili: i30303
lexfile: verb.creation
part of speech: verb
hypernym: 01715304-v

typeset-v
type: LexicalEntry
canonical form: typeset
sense: 01748696-v
part of speech: verb

01748696-v
type: LexicalConcept
in scheme: en-word.net
definition: set in type
example: My book will be typeset nicely
example: set these words in italics
ili: i30457
lexfile: verb.creation
part of speech: verb
hypernym: 01751753-v

fit-a
type: LexicalEntry
canonical form: fit
sense: 01937602-s
part of speech: adjective

primed-a
type: LexicalEntry
canonical form: primed
sense: 01937602-s
part of speech: adjective

01937602-s
type: LexicalConcept
in scheme: en-word.net
definition: (usually followed by ‘to’ or ‘for’) on the point of or strongly disposed
example: in no fit state to continue
example: fit to drop
example: laughing fit to burst
example: she was fit to scream
example: primed for a fight
example: we are set to go at any time
ili: i10589
lexfile: adj.all
part of speech: adjective satellite
similar: https://en-word.net/synset/01936911-a

go down-v
type: LexicalEntry
canonical form: go down
sense: 01974660-v
part of speech: verb

go under-v
type: LexicalEntry
canonical form: go under
sense: 01974660-v
part of speech: verb

01974660-v
type: LexicalConcept
in scheme: en-word.net
definition: disappear beyond the horizon
example: the sun sets early these days
ili: i31584
lexfile: verb.motion
part of speech: verb
domain topic: 06104629-n
hypernym: 01974840-v

located-a
type: LexicalEntry
canonical form: located
sense: 02133811-s
part of speech: adjective

placed-a
type: LexicalEntry
canonical form: placed
sense: 02133811-s
part of speech: adjective

situated-a
type: LexicalEntry
canonical form: situated
sense: 02133811-s
part of speech: adjective

02133811-s
type: LexicalConcept
in scheme: en-word.net
definition: situated in a particular spot or position
example: valuable centrally located urban land
example: strategically placed artillery
example: a house set on a hilltop
example: nicely situated on a quiet riverbank
ili: i11644
lexfile: adj.all
part of speech: adjective satellite
similar: https://en-word.net/synset/02133178-a

determined-a
type: LexicalEntry
canonical form: determined
sense: 02137288-s
part of speech: adjective

dictated-a
type: LexicalEntry
canonical form: dictated
sense: 02137288-s
part of speech: adjective

02137288-s
type: LexicalConcept
in scheme: en-word.net
definition: determined or decided upon as by an authority
example: date and place are already determined
example: the dictated terms of surrender
example: the time set for the launching
ili: i11662
lexfile: adj.all
part of speech: adjective satellite
similar: https://en-word.net/synset/02136639-a

02502978-s
type: LexicalConcept
in scheme: en-word.net
definition: being below the horizon
example: the moon is set
ili: i13826
lexfile: adj.all
part of speech: adjective satellite
similar: https://en-word.net/synset/02501639-a

04183589-n
type: LexicalConcept
in scheme: en-word.net
definition: any electronic equipment that receives or transmits radio or tv signals
example: the early sets ran on storage batteries
ili: i58694
lexfile: noun.artifact
part of speech: noun
hypernym: 03283159-n

stage set-n
type: LexicalEntry
canonical form: stage set
sense: 04304614-n
part of speech: noun

04304614-n
type: LexicalConcept
in scheme: en-word.net
definition: representation consisting of the scenery and other properties used to identify the location of a dramatic production
example: the sets were meticulously authentic
ili: i59443
lexfile: noun.artifact
part of speech: noun
hypernym: 04083958-n
mero part: 04183950-n

readiness-n
type: LexicalEntry
canonical form: readiness
sense: 05682428-n
part of speech: noun

05682428-n
type: LexicalConcept
in scheme: en-word.net
definition: (psychology) being temporarily ready to respond in a particular way
example: the subjects' set led them to solve problems the familiar way and to overlook the simpler solution
example: his instructions deliberately gave them the wrong set
ili: i66738
lexfile: noun.cognition
part of speech: noun
domain topic: 06145709-n
hypernym: 05677778-n

bent-n
type: LexicalEntry
canonical form: bent
sense: 06209437-n
part of speech: noun

06209437-n
type: LexicalConcept
in scheme: en-word.net
definition: a relatively permanent inclination to react in a particular way
example: the set of his mind was obvious
ili: i69109
lexfile: noun.cognition
part of speech: noun
hypernym: 06206319-n

07378145-n
type: LexicalConcept
in scheme: en-word.net
definition: the descent of a heavenly body below the horizon
example: before the set of sun
ili: i75388
lexfile: noun.event
part of speech: noun
hypernym: 07377946-n

08013131-n
type: LexicalConcept
in scheme: en-word.net
definition: a group of things of the same kind that belong together and are so used
example: a set of books
example: a set of golf clubs
example: a set of teeth
ili: i79315
lexfile: noun.group
part of speech: noun
hypernym: 07968050-n
mero member: 06425309-n

08016141-n
type: LexicalConcept
in scheme: en-word.net
definition: (mathematics) an abstract collection of numbers or symbols
example: the set of prime numbers is infinite
ili: i79330
lexfile: noun.group
part of speech: noun
domain topic: 06009822-n
hypernym: 00002137-n

circle-n
type: LexicalEntry
canonical form: circle
sense: 08257090-n
part of speech: noun

band-n
type: LexicalEntry
canonical form: band
sense: 08257090-n
part of speech: noun

lot-n
type: LexicalEntry
canonical form: lot
sense: 08257090-n
part of speech: noun

08257090-n
type: LexicalConcept
in scheme: en-word.net
definition: an unofficial association of people or groups
example: the smart set goes there
example: they were an angry lot
ili: i80424
lexfile: noun.group
part of speech: noun
hypernym: 07967506-n

hardening-n
type: LexicalEntry
canonical form: hardening
sense: 13512263-n
part of speech: noun

solidifying-n
type: LexicalEntry
canonical form: solidifying
sense: 13512263-n
part of speech: noun

solidification-n
type: LexicalEntry
canonical form: solidification
sense: 13512263-n
part of speech: noun

curing-n
type: LexicalEntry
canonical form: curing
sense: 13512263-n
part of speech: noun

13512263-n
type: LexicalConcept
in scheme: en-word.net
definition: the process of becoming hard or solid by cooling or drying or crystallization
example: the hardening of concrete
example: he tested the set of the glue
ili: i107625
lexfile: noun.process
part of speech: noun
hypernym: 13540166-n

15281228-n
type: LexicalConcept
in scheme: en-word.net
definition: a unit of play in tennis or squash
example: they played two sets of tennis after dinner
ili: i117418
lexfile: noun.time
part of speech: noun
hypernym: 15281726-n
mero part: 15281378-n