garage-n
type: LexicalEntry
canonical form: garage
sense: 03421550-n
part of speech: noun

service department-n
type: LexicalEntry
canonical form: service department
sense: 03421550-n
part of speech: noun
sense: 08136673-n

03421550-n
type: LexicalConcept
in scheme: en-word.net
definition: a repair shop where cars and trucks are serviced and repaired
ili: i54173
lexfile: noun.artifact
part of speech: noun
hypernym: 04083028-n

08136673-n
type: LexicalConcept
in scheme: en-word.net
definition: the division of a business that provides customer services
ili: i79857
lexfile: noun.group
part of speech: noun
hypernym: 08135014-n