freestanding-a
type: LexicalEntry
canonical form: freestanding
sense: 00162033-s
part of speech: adjective

separate-a
type: LexicalEntry
canonical form: separate
sense: 00162033-s
part of speech: adjective
sense: 00570805-s
sense: 01330323-s
sense: https://en-word.net/lemma/separate-a#02116958-a

00162033-s
type: LexicalConcept
in scheme: en-word.net
definition: standing apart; not attached to or supported by anything
example: a freestanding bell tower
example: a house with a separate garage
ili: i871
lexfile: adj.all
part of speech: adjective satellite
similar: https://en-word.net/synset/00161838-a

branch-v
type: LexicalEntry
canonical form: branch
sense: 00329612-v
part of speech: verb

ramify-v
type: LexicalEntry
canonical form: ramify
sense: 00329612-v
part of speech: verb

fork-v
type: LexicalEntry
canonical form: fork
sense: 00329612-v
part of speech: verb

furcate-v
type: LexicalEntry
canonical form: furcate
sense: 00329612-v
part of speech: verb

separate-v
type: LexicalEntry
canonical form: separate
sense: 00329612-v
part of speech: verb
sense: 00334996-v
sense: 00652006-v
sense: 00656296-v
sense: 01461602-v
sense: 01559703-v
sense: 01560556-v
sense: 02034003-v
sense: 02035003-v
sense: 02436167-v
sense: 02473085-v
sense: 02517971-v
sense: 02627934-v

00329612-v
type: LexicalConcept
in scheme: en-word.net
definition: divide into two or more branches so as to form a fork
example: The road forks
ili: i23379
lexfile: verb.change
part of speech: verb
hypernym: 02036260-v
similar: 00330054-v

break-v
type: LexicalEntry
canonical form: break
sense: 00334996-v
part of speech: verb
sense: 02436167-v

split up-v
type: LexicalEntry
canonical form: split up
sense: 00334996-v
part of speech: verb
sense: 02436167-v
sense: 02473085-v

fall apart-v
type: LexicalEntry
canonical form: fall apart
sense: 00334996-v
part of speech: verb

come apart-v
type: LexicalEntry
canonical form: come apart
sense: 00334996-v
part of speech: verb

00334996-v
type: LexicalConcept
in scheme: en-word.net
definition: become separated into pieces or fragments
example: The figurine broke
example: The freshly baked loaf fell apart
ili: i23406
lexfile: verb.change
part of speech: verb
also: 00147635-v
hypernym: 00139943-v
similar: 00335806-v

disjoined-a
type: LexicalEntry
canonical form: disjoined
sense: 00570805-s
part of speech: adjective

00570805-s
type: LexicalConcept
in scheme: en-word.net
definition: have the connection undone; having become separate
ili: i3169
lexfile: adj.all
part of speech: adjective satellite
similar: https://en-word.net/synset/00569857-a

distinguish-v
type: LexicalEntry
canonical form: distinguish
sense: 00652006-v
part of speech: verb

differentiate-v
type: LexicalEntry
canonical form: differentiate
sense: 00652006-v
part of speech: verb

secern-v
type: LexicalEntry
canonical form: secern
sense: 00652006-v
part of speech: verb

secernate-v
type: LexicalEntry
canonical form: secernate
sense: 00652006-v
part of speech: verb

severalize-v
type: LexicalEntry
canonical form: severalize
sense: 00652006-v
part of speech: verb

severalise-v
type: LexicalEntry
canonical form: severalise
sense: 00652006-v
part of speech: verb

tell-v
type: LexicalEntry
canonical form: tell
sense: 00652006-v
part of speech: verb

tell apart-v
type: LexicalEntry
canonical form: tell apart
sense: 00652006-v
part of speech: verb

00652006-v
type: LexicalConcept
in scheme: en-word.net
definition: mark as different
example: We distinguish several kinds of maple
ili: i24985
lexfile: verb.cognition
part of speech: verb
entails: 00654571-v
hypernym: 00620568-v

classify-v
type: LexicalEntry
canonical form: classify
sense: 00656296-v
part of speech: verb

class-v
type: LexicalEntry
canonical form: class
sense: 00656296-v
part of speech: verb

sort-v
type: LexicalEntry
canonical form: sort
sense: 00656296-v
part of speech: verb

assort-v
type: LexicalEntry
canonical form: assort
sense: 00656296-v
part of speech: verb

sort out-v
type: LexicalEntry
canonical form: sort out
sense: 00656296-v
part of speech: verb

00656296-v
type: LexicalConcept
in scheme: en-word.net
definition: arrange or order by classes or categories
example: How would you classify these pottery shards — are they prehistoric?
ili: i25002
lexfile: verb.cognition
part of speech: verb
entails: 00654571-v
hypernym: 00658931-v

01330323-s
type: LexicalConcept
in scheme: en-word.net
definition: separated according to race, sex, class, or religion
example: separate but equal
example: girls and boys in separate classes
ili: i7237
lexfile: adj.all
part of speech: adjective satellite
similar: https://en-word.net/synset/01329869-a

01461602-v
type: LexicalConcept
in scheme: en-word.net
definition: divide into components or constituents
example: Separate the wheat from the chaff
ili: i29018
lexfile: verb.contact
part of speech: verb
hypernym: 00139943-v

disunite-v
type: LexicalEntry
canonical form: disunite
sense: 01559703-v
part of speech: verb

divide-v
type: LexicalEntry
canonical form: divide
sense: 01559703-v
part of speech: verb
sense: 01560556-v
sense: 02035003-v
sense: 02473085-v
sense: 02627934-v

part-v
type: LexicalEntry
canonical form: part
sense: 01559703-v
part of speech: verb
sense: 01560556-v
sense: 02034003-v
sense: 02436167-v

01559703-v
type: LexicalConcept
in scheme: en-word.net
definition: force, take, or pull apart
example: He separated the fighting children
example: Moses parted the Red Sea
ili: i29513
lexfile: verb.contact
part of speech: verb
causes: 01560556-v
hypernym: 01854282-v

01560556-v
type: LexicalConcept
in scheme: en-word.net
definition: move or break apart
example: The two pieces that we had glued separated
ili: i29517
lexfile: verb.contact
part of speech: verb
hypernym: 00109468-v

split-v
type: LexicalEntry
canonical form: split
sense: 02034003-v
part of speech: verb
sense: 02436167-v
sense: 02473085-v

02034003-v
type: LexicalConcept
in scheme: en-word.net
definition: go one's own way; move apart
example: The friends separated after the party
ili: i31892
lexfile: verb.motion
part of speech: verb
hypernym: 01835473-v

02035003-v
type: LexicalConcept
in scheme: en-word.net
definition: make a division or separation
ili: i31896
lexfile: verb.motion
part of speech: verb
hypernym: 02372362-v

https://en-word.net/synset/02116958-a
type: LexicalConcept
in scheme: en-word.net
definition: independent; not united or joint
example: a problem consisting of two separate issues
example: they went their separate ways
example: formed a separate church
ili: i11562
lexfile: adj.all
part of speech: adjective
also: https://en-word.net/synset/02488224-a
also: https://en-word.net/synset/00731008-a
also: https://en-word.net/synset/00495505-a
also: https://en-word.net/synset/02076759-a
also: https://en-word.net/synset/01329869-a
also: https://en-word.net/synset/02160263-a
attribute: 14437698-n
similar: 02117441-s
similar: 02117597-s
similar: 02117727-s
similar: 02118058-s
similar: 02118273-s
similar: 02118375-s
similar: 02118619-s
similar: 02118766-s

break up-v
type: LexicalEntry
canonical form: break up
sense: 02436167-v
part of speech: verb

02436167-v
type: LexicalConcept
in scheme: en-word.net
definition: discontinue an association or relation; go different ways
example: The business partners broke over a tax question
example: The couple separated after 25 years of marriage
example: My friend and I split up
ili: i33886
lexfile: verb.social
part of speech: verb
hypernym: 02686624-v

dissever-v
type: LexicalEntry
canonical form: dissever
sense: 02473085-v
part of speech: verb

carve up-v
type: LexicalEntry
canonical form: carve up
sense: 02473085-v
part of speech: verb

02473085-v
type: LexicalConcept
in scheme: en-word.net
definition: separate into parts or portions
example: divide the cake into three equal parts
example: The British carved up the Ottoman Empire after World War I
ili: i34058
lexfile: verb.social
part of speech: verb
hypernym: 00139943-v

discriminate-v
type: LexicalEntry
canonical form: discriminate
sense: 02517971-v
part of speech: verb

single out-v
type: LexicalEntry
canonical form: single out
sense: 02517971-v
part of speech: verb

02517971-v
type: LexicalConcept
in scheme: en-word.net
definition: treat differently on the basis of sex or race
ili: i34274
lexfile: verb.social
part of speech: verb
hypernym: 00652006-v

02627934-v
type: LexicalConcept
in scheme: en-word.net
definition: act as a barrier between; stand between
example: The mountain range divides the two countries
ili: i34782
lexfile: verb.stative
part of speech: verb
hypernym: 02531113-v

separate-n
type: LexicalEntry
canonical form: separate
sense: 04179965-n
part of speech: noun
sense: 06280438-n

04179965-n
type: LexicalConcept
in scheme: en-word.net
definition: a garment that can be purchased separately and worn in combinations with other garments
ili: i58670
lexfile: noun.artifact
part of speech: noun
hypernym: 03423924-n

offprint-n
type: LexicalEntry
canonical form: offprint
sense: 06280438-n
part of speech: noun

reprint-n
type: LexicalEntry
canonical form: reprint
sense: 06280438-n
part of speech: noun

06280438-n
type: LexicalConcept
in scheme: en-word.net
definition: a separately printed article that originally appeared in a larger publication
ili: i69455
lexfile: noun.communication
part of speech: noun
hypernym: 06278749-n