self-denial-n
type: LexicalEntry
canonical form: self-denial
sense: 01071502-n
part of speech: noun
sense: 04889024-n

self-discipline-n
type: LexicalEntry
canonical form: self-discipline
sense: 01071502-n
part of speech: noun
sense: 04889024-n

self-control-n
type: LexicalEntry
canonical form: self-control
sense: 01071502-n
part of speech: noun

01071502-n
type: LexicalConcept
in scheme: en-word.net
definition: the act of denying yourself; controlling your impulses
ili: i41018
lexfile: noun.act
part of speech: noun
hypernym: 00805278-n

04889024-n
type: LexicalConcept
in scheme: en-word.net
definition: the trait of practicing self discipline
ili: i62639
lexfile: noun.attribute
part of speech: noun
hypernym: 04888818-n