science-n
type: LexicalEntry
canonical form: science
sense: 06008975-n
part of speech: noun

scientific discipline-n
type: LexicalEntry
canonical form: scientific discipline
sense: 06008975-n
part of speech: noun

06008975-n
type: LexicalConcept
in scheme: en-word.net
definition: a particular branch of scientific knowledge
example: the science of genetics
ili: i68339
lexfile: noun.cognition
part of speech: noun
hypernym: 06005806-n
mero part: 06002729-n