schooldays-n
type: LexicalEntry
canonical form: schooldays
sense: 15172558-n
part of speech: noun

schooltime-n
type: LexicalEntry
canonical form: schooltime
sense: 15172558-n
part of speech: noun
sense: 15228025-n

15172558-n
type: LexicalConcept
in scheme: en-word.net
definition: the time of life when you are going to school
ili: i116802
lexfile: noun.time
part of speech: noun
hypernym: 15169331-n

school-n
type: LexicalEntry
canonical form: school
sense: 15228025-n
part of speech: noun

school day-n
type: LexicalEntry
canonical form: school day
sense: 15228025-n
part of speech: noun

15228025-n
type: LexicalConcept
in scheme: en-word.net
definition: the period of instruction in a school; the time period when school is in session
example: stay after school
example: he didn't miss a single day of school
example: when the school day was done we would walk home together
ili: i117114
lexfile: noun.time
part of speech: noun
hypernym: 15137796-n
mero part: 15324468-n