schooling-n
type: LexicalEntry
canonical form: schooling
sense: 00890371-n
part of speech: noun
sense: 00897681-n
sense: 05765533-n

00890371-n
type: LexicalConcept
in scheme: en-word.net
definition: the act of teaching at school
ili: i40066
lexfile: noun.act
part of speech: noun
hypernym: 00888759-n

00897681-n
type: LexicalConcept
in scheme: en-word.net
definition: the training of an animal (especially the training of a horse for dressage)
ili: i40112
lexfile: noun.act
part of speech: noun
hypernym: 00895653-n

school-n
type: LexicalEntry
canonical form: school
sense: 05765533-n
part of speech: noun

05765533-n
type: LexicalConcept
in scheme: en-word.net
definition: the process of being formally educated at a school
example: what will you do when you finish school?
ili: i67156
lexfile: noun.cognition
part of speech: noun
hypernym: 05761561-n