outline-n
type: LexicalEntry
canonical form: outline
sense: 05900179-n
part of speech: noun

schema-n
type: LexicalEntry
canonical form: schema
sense: 05900179-n
part of speech: noun
sense: 05936599-n

scheme-n
type: LexicalEntry
canonical form: scheme
sense: 05900179-n
part of speech: noun
sense: 05936599-n

05900179-n
type: LexicalConcept
in scheme: en-word.net
definition: a schematic or preliminary plan
ili: i67806
lexfile: noun.cognition
part of speech: noun
hypernym: 05907175-n

05936599-n
type: LexicalConcept
in scheme: en-word.net
definition: an internal representation of the world; an organization of concepts and actions that can be revised by new information about the world
ili: i67981
lexfile: noun.cognition
part of speech: noun
hypernym: 05935308-n