sangaree-n
type: LexicalEntry
canonical form: sangaree
sense: 07933210-n
part of speech: noun

sangria-n
type: LexicalEntry
canonical form: sangria
sense: 07933210-n
part of speech: noun

07933210-n
type: LexicalConcept
in scheme: en-word.net
definition: sweetened red wine and orange or lemon juice with soda water
ili: i78886
lexfile: noun.food
part of speech: noun
domain region: 09045691-n
hypernym: 07901198-n
mero substance: 07908487-n