gloominess-n
type: LexicalEntry
canonical form: gloominess
sense: 04638827-n
part of speech: noun

lugubriousness-n
type: LexicalEntry
canonical form: lugubriousness
sense: 04638827-n
part of speech: noun

sadness-n
type: LexicalEntry
canonical form: sadness
sense: 04638827-n
part of speech: noun
sense: 07547828-n
sense: 14012536-n

04638827-n
type: LexicalConcept
in scheme: en-word.net
definition: the quality of excessive mournfulness and uncheerfulness
ili: i61414
lexfile: noun.attribute
part of speech: noun
hypernym: 04638655-n

unhappiness-n
type: LexicalEntry
canonical form: unhappiness
sense: 07547828-n
part of speech: noun

07547828-n
type: LexicalConcept
in scheme: en-word.net
definition: emotions experienced when not in a state of well-being
ili: i76337
lexfile: noun.feeling
part of speech: noun
hypernym: 00026390-n

sorrow-n
type: LexicalEntry
canonical form: sorrow
sense: 14012536-n
part of speech: noun

sorrowfulness-n
type: LexicalEntry
canonical form: sorrowfulness
sense: 14012536-n
part of speech: noun

14012536-n
type: LexicalConcept
in scheme: en-word.net
definition: the state of being sad
example: she tired of his perpetual sadness
ili: i110448
lexfile: noun.state
part of speech: noun
hypernym: 14012148-n