rumba-n
type: LexicalEntry
canonical form: rumba
sense: 00538122-n
part of speech: noun
sense: 00542816-n
sense: 07070804-n

rhumba-n
type: LexicalEntry
canonical form: rhumba
sense: 00538122-n
part of speech: noun
sense: 00542816-n
sense: 07070804-n

00538122-n
type: LexicalConcept
in scheme: en-word.net
definition: a ballroom dance based on the Cuban folk dance
ili: i38208
lexfile: noun.act
part of speech: noun
hypernym: 00535886-n

00542816-n
type: LexicalConcept
in scheme: en-word.net
definition: a folk dance in duple time that originated in Cuba with Spanish and African elements; features complex footwork and violent movement
ili: i38238
lexfile: noun.act
part of speech: noun
hypernym: 00538719-n

rhumba-v
type: LexicalEntry
canonical form: rhumba
sense: 01901772-v
part of speech: verb

rumba-v
type: LexicalEntry
canonical form: rumba
sense: 01901772-v
part of speech: verb

01901772-v
type: LexicalConcept
in scheme: en-word.net
definition: dance the rhumba
ili: i31204
lexfile: verb.motion
part of speech: verb
hypernym: 01712535-v

07070804-n
type: LexicalConcept
in scheme: en-word.net
definition: syncopated music in duple time for dancing the rumba
ili: i73765
lexfile: noun.communication
part of speech: noun
hypernym: 07068473-n