repent-v
type: LexicalEntry
canonical form: repent
sense: 01800593-v
part of speech: verb

regret-v
type: LexicalEntry
canonical form: regret
sense: 01800593-v
part of speech: verb

rue-v
type: LexicalEntry
canonical form: rue
sense: 01800593-v
part of speech: verb

01800593-v
type: LexicalConcept
in scheme: en-word.net
definition: feel remorse for; feel sorry for; be contrite about
ili: i30713
lexfile: verb.emotion
part of speech: verb
hypernym: 01775456-v

rue-n
type: LexicalEntry
canonical form: rue
sense: 04125011-n
part of speech: noun
sense: 07551058-n
sense: 07836273-n
sense: 12727959-n

04125011-n
type: LexicalConcept
in scheme: en-word.net
definition: (French) a street or road in France
ili: i58336
lexfile: noun.artifact
part of speech: noun
domain region: 08949695-n
hypernym: 04341737-n

sorrow-n
type: LexicalEntry
canonical form: sorrow
sense: 07551058-n
part of speech: noun

regret-n
type: LexicalEntry
canonical form: regret
sense: 07551058-n
part of speech: noun

ruefulness-n
type: LexicalEntry
canonical form: ruefulness
sense: 07551058-n
part of speech: noun

07551058-n
type: LexicalConcept
in scheme: en-word.net
definition: sadness associated with some wrong done or some disappointment
example: he drank to drown his sorrows
example: he wrote a note expressing his regret
example: to his rue, the error cost him the game
ili: i76356
lexfile: noun.feeling
part of speech: noun
hypernym: 07547828-n

07836273-n
type: LexicalConcept
in scheme: en-word.net
definition: leaves sometimes used for flavoring fruit or claret cup but should be used with great caution: can cause irritation like poison ivy
ili: i78225
lexfile: noun.food
part of speech: noun
hypernym: 07827392-n

herb of grace-n
type: LexicalEntry
canonical form: herb of grace
sense: 12727959-n
part of speech: noun

Ruta graveolens-n
type: LexicalEntry
canonical form: Ruta graveolens
sense: 12727959-n
part of speech: noun

12727959-n
type: LexicalConcept
in scheme: en-word.net
definition: European strong-scented perennial herb with grey-green bitter-tasting leaves; an irritant similar to poison ivy
ili: i103633
lexfile: noun.plant
part of speech: noun
hypernym: 12226211-n
mero part: 07836273-n