rosin-v
type: LexicalEntry
canonical form: rosin
sense: 01253240-v
part of speech: verb

01253240-v
type: LexicalConcept
in scheme: en-word.net
definition: rub rosin onto
example: rosin the violin bow
ili: i27892
lexfile: verb.contact
part of speech: verb
hypernym: 01252288-v

resin-n
type: LexicalEntry
canonical form: resin
sense: 14918291-n
part of speech: noun

rosin-n
type: LexicalEntry
canonical form: rosin
sense: 14918291-n
part of speech: noun

14918291-n
type: LexicalConcept
in scheme: en-word.net
definition: any of a class of solid or semisolid viscous substances obtained either as exudations from certain plants or prepared by polymerization of simple molecules
ili: i115350
lexfile: noun.substance
part of speech: noun
hypernym: 14751849-n