suite-n
type: LexicalEntry
canonical form: suite
sense: 04358628-n
part of speech: noun

rooms-n
type: LexicalEntry
canonical form: rooms
sense: 04358628-n
part of speech: noun

04358628-n
type: LexicalConcept
in scheme: en-word.net
definition: apartment consisting of a series of connected rooms used as a living unit (as in a hotel)
ili: i59762
lexfile: noun.artifact
part of speech: noun
hypernym: 02729230-n