roll-v
type: LexicalEntry
canonical form: roll
sense: 00100164-v
part of speech: verb
sense: 00124886-v
sense: 00125097-v
sense: 00143024-v
sense: 00325228-v
sense: 01057850-v
sense: 01393934-v
sense: 01525056-v
sense: 01528927-v
sense: 01870178-v
sense: 01870596-v
sense: 01879677-v
sense: 01885173-v
sense: 01891013-v
sense: 01905776-v
sense: 02202528-v
sense: 02327592-v
sense: 02693093-v

00100164-v
type: LexicalConcept
in scheme: en-word.net
definition: execute a roll, in tumbling
example: The gymnasts rolled and jumped
ili: i22275
lexfile: verb.body
part of speech: verb
hypernym: 00099989-v

roll-n
type: LexicalEntry
canonical form: roll
sense: 00105229-n
part of speech: noun
sense: 00171161-n
sense: 00290503-n
sense: 01248360-n
sense: 04108326-n
sense: 04108469-n
sense: 06419376-n
sense: 06506991-n
sense: 07364132-n
sense: 07403416-n
sense: 07403930-n
sense: 07456219-n
sense: 07696677-n
sense: 13377742-n
sense: 13898609-n

bowl-n
type: LexicalEntry
canonical form: bowl
sense: 00105229-n
part of speech: noun

00105229-n
type: LexicalConcept
in scheme: en-word.net
definition: the act of rolling something (as the ball in bowling)
ili: i35954
lexfile: noun.act
part of speech: noun
hypernym: 00045991-n

roll up-v
type: LexicalEntry
canonical form: roll up
sense: 00124886-v
part of speech: verb

00124886-v
type: LexicalConcept
in scheme: en-word.net
definition: show certain properties when being rolled
example: The carpet rolls unevenly
example: dried-out tobacco rolls badly
ili: i22383
lexfile: verb.change
part of speech: verb
hypernym: 00109468-v
similar: 00436641-v
similar: 00436806-v

00125097-v
type: LexicalConcept
in scheme: en-word.net
definition: take the shape of a roll or cylinder
example: the carpet rolled out
example: Yarn rolls well
ili: i22384
lexfile: verb.change
part of speech: verb
hypernym: 00140787-v

00143024-v
type: LexicalConcept
in scheme: en-word.net
definition: shape by rolling
example: roll a cigarette
ili: i22431
lexfile: verb.change
part of speech: verb
hypernym: 00142011-v

00171161-n
type: LexicalConcept
in scheme: en-word.net
definition: a flight maneuver; aircraft rotates about its longitudinal axis without changing direction or losing altitude
ili: i36306
lexfile: noun.act
part of speech: noun
hypernym: 00171665-n

00290503-n
type: LexicalConcept
in scheme: en-word.net
definition: walking with a swaying gait
ili: i36918
lexfile: noun.act
part of speech: noun
hypernym: 00287341-n

seethe-v
type: LexicalEntry
canonical form: seethe
sense: 00325228-v
part of speech: verb

00325228-v
type: LexicalConcept
in scheme: en-word.net
definition: boil vigorously
example: The liquid was seething
example: The water rolled
ili: i23354
lexfile: verb.change
part of speech: verb
hypernym: 01889423-v

01057850-v
type: LexicalConcept
in scheme: en-word.net
definition: pronounce with a roll, of the phoneme /r/
example: She rolls her r's
ili: i26861
lexfile: verb.communication
part of speech: verb
hypernym: 00980581-v

cast-n
type: LexicalEntry
canonical form: cast
sense: 01248360-n
part of speech: noun

01248360-n
type: LexicalConcept
in scheme: en-word.net
definition: the act of throwing dice
ili: i41922
lexfile: noun.act
part of speech: noun
hypernym: 01248165-n

roll out-v
type: LexicalEntry
canonical form: roll out
sense: 01393934-v
part of speech: verb

01393934-v
type: LexicalConcept
in scheme: en-word.net
definition: flatten or spread with a roller
example: roll out the paper
ili: i28672
lexfile: verb.contact
part of speech: verb
hypernym: 00464691-v

wind-v-1
type: LexicalEntry
canonical form: wind
sense: 01525056-v
part of speech: verb

wrap-v
type: LexicalEntry
canonical form: wrap
sense: 01525056-v
part of speech: verb

twine-v
type: LexicalEntry
canonical form: twine
sense: 01525056-v
part of speech: verb

01525056-v
type: LexicalConcept
in scheme: en-word.net
definition: arrange or coil around
example: roll your hair around your finger
example: Twine the thread around the spool
example: She wrapped her arms around the child
ili: i29339
lexfile: verb.contact
part of speech: verb
hypernym: 01854282-v

01528927-v
type: LexicalConcept
in scheme: en-word.net
definition: begin operating or running
example: The cameras were rolling
example: The presses are already rolling
ili: i29359
lexfile: verb.contact
part of speech: verb
hypernym: 01528454-v

turn over-v
type: LexicalEntry
canonical form: turn over
sense: 01870178-v
part of speech: verb

01870178-v
type: LexicalConcept
in scheme: en-word.net
definition: move by turning over or rotating
example: The child rolled down the hill
example: turn over on your left side
ili: i31034
lexfile: verb.motion
part of speech: verb
hypernym: 01911251-v
similar: 01870596-v

revolve-v
type: LexicalEntry
canonical form: revolve
sense: 01870596-v
part of speech: verb

01870596-v
type: LexicalConcept
in scheme: en-word.net
definition: cause to move by turning over or in a circular manner of as if on an axis
example: She rolled the ball
example: They rolled their eyes at his words
ili: i31036
lexfile: verb.motion
part of speech: verb
hypernym: 01854282-v
similar: 01870178-v

01879677-v
type: LexicalConcept
in scheme: en-word.net
definition: move, rock, or sway from side to side
example: The ship rolled on the heavy seas
ili: i31085
lexfile: verb.motion
part of speech: verb
hypernym: 01879288-v

wander-v
type: LexicalEntry
canonical form: wander
sense: 01885173-v
part of speech: verb

swan-v
type: LexicalEntry
canonical form: swan
sense: 01885173-v
part of speech: verb

stray-v
type: LexicalEntry
canonical form: stray
sense: 01885173-v
part of speech: verb

tramp-v
type: LexicalEntry
canonical form: tramp
sense: 01885173-v
part of speech: verb

roam-v
type: LexicalEntry
canonical form: roam
sense: 01885173-v
part of speech: verb

cast-v
type: LexicalEntry
canonical form: cast
sense: 01885173-v
part of speech: verb

ramble-v
type: LexicalEntry
canonical form: ramble
sense: 01885173-v
part of speech: verb

rove-v
type: LexicalEntry
canonical form: rove
sense: 01885173-v
part of speech: verb

range-v
type: LexicalEntry
canonical form: range
sense: 01885173-v
part of speech: verb

drift-v
type: LexicalEntry
canonical form: drift
sense: 01885173-v
part of speech: verb

vagabond-v
type: LexicalEntry
canonical form: vagabond
sense: 01885173-v
part of speech: verb

01885173-v
type: LexicalConcept
in scheme: en-word.net
definition: move about aimlessly or without any destination, often in search of food or employment
example: The gypsies roamed the woods
example: roving vagabonds
example: the wandering Jew
example: The cattle roam across the prairie
example: the laborers drift from one town to the next
example: They rolled from town to town
ili: i31113
lexfile: verb.motion
part of speech: verb
hypernym: 01839438-v
similar: 01929647-v
similar: 02107118-v

wheel-v
type: LexicalEntry
canonical form: wheel
sense: 01891013-v
part of speech: verb

01891013-v
type: LexicalConcept
in scheme: en-word.net
definition: move along on or as if on wheels or a wheeled vehicle
example: The President's convoy rolled past the crowds
ili: i31140
lexfile: verb.motion
part of speech: verb
hypernym: 01839438-v

undulate-v
type: LexicalEntry
canonical form: undulate
sense: 01905776-v
part of speech: verb
sense: 02693093-v

flap-v
type: LexicalEntry
canonical form: flap
sense: 01905776-v
part of speech: verb

wave-v
type: LexicalEntry
canonical form: wave
sense: 01905776-v
part of speech: verb

01905776-v
type: LexicalConcept
in scheme: en-word.net
definition: move in a wavy pattern or with a rising and falling motion
example: The curtains undulated
example: the waves rolled towards the beach
ili: i31229
lexfile: verb.motion
part of speech: verb
hypernym: 01835473-v

02202528-v
type: LexicalConcept
in scheme: en-word.net
definition: emit, produce, or utter with a deep prolonged reverberating sound
example: The thunder rolled
example: rolling drums
ili: i32746
lexfile: verb.perception
part of speech: verb
hypernym: 02180712-v

hustle-v
type: LexicalEntry
canonical form: hustle
sense: 02327592-v
part of speech: verb

pluck-v
type: LexicalEntry
canonical form: pluck
sense: 02327592-v
part of speech: verb

02327592-v
type: LexicalConcept
in scheme: en-word.net
definition: sell something to or obtain something from by energetic and especially underhanded activity
ili: i33348
lexfile: verb.possession
part of speech: verb
hypernym: 02326737-v

02693093-v
type: LexicalConcept
in scheme: en-word.net
definition: occur in soft rounded shapes
example: The hills rolled past
ili: i35089
lexfile: verb.stative
part of speech: verb
hypernym: 02618403-v

04108326-n
type: LexicalConcept
in scheme: en-word.net
definition: anything rolled up in cylindrical form
ili: i58234
lexfile: noun.artifact
part of speech: noun
hypernym: 13887919-n

04108469-n
type: LexicalConcept
in scheme: en-word.net
definition: photographic film rolled up inside a container to protect it from light
ili: i58235
lexfile: noun.artifact
part of speech: noun
hypernym: 03343766-n

scroll-n
type: LexicalEntry
canonical form: scroll
sense: 06419376-n
part of speech: noun
sense: 13898609-n

06419376-n
type: LexicalConcept
in scheme: en-word.net
definition: a document that can be rolled up (as for storage)
ili: i70161
lexfile: noun.communication
part of speech: noun
hypernym: 06418864-n

roster-n
type: LexicalEntry
canonical form: roster
sense: 06506991-n
part of speech: noun

06506991-n
type: LexicalConcept
in scheme: en-word.net
definition: a list of names
example: his name was struck off the rolls
ili: i70589
lexfile: noun.communication
part of speech: noun
hypernym: 06492991-n

roller-n
type: LexicalEntry
canonical form: roller
sense: 07364132-n
part of speech: noun

rolling wave-n
type: LexicalEntry
canonical form: rolling wave
sense: 07364132-n
part of speech: noun

07364132-n
type: LexicalConcept
in scheme: en-word.net
definition: a long heavy sea wave as it advances towards the shore
ili: i75314
lexfile: noun.event
part of speech: noun
hypernym: 07366790-n

paradiddle-n
type: LexicalEntry
canonical form: paradiddle
sense: 07403416-n
part of speech: noun

drum roll-n
type: LexicalEntry
canonical form: drum roll
sense: 07403416-n
part of speech: noun

07403416-n
type: LexicalConcept
in scheme: en-word.net
definition: the sound of a drum (especially a snare drum) beaten rapidly and continuously
ili: i75522
lexfile: noun.event
part of speech: noun
hypernym: 07385893-n

peal-n
type: LexicalEntry
canonical form: peal
sense: 07403930-n
part of speech: noun

pealing-n
type: LexicalEntry
canonical form: pealing
sense: 07403930-n
part of speech: noun

rolling-n
type: LexicalEntry
canonical form: rolling
sense: 07403930-n
part of speech: noun

07403930-n
type: LexicalConcept
in scheme: en-word.net
definition: a deep prolonged sound (as of thunder or large bells)
ili: i75525
lexfile: noun.event
part of speech: noun
hypernym: 07385893-n

axial rotation-n
type: LexicalEntry
canonical form: axial rotation
sense: 07456219-n
part of speech: noun

axial motion-n
type: LexicalEntry
canonical form: axial motion
sense: 07456219-n
part of speech: noun

07456219-n
type: LexicalConcept
in scheme: en-word.net
definition: rotary motion of an object around its own axis
example: wheels in axial rotation
ili: i75818
lexfile: noun.event
part of speech: noun
hypernym: 07455579-n

bun-n
type: LexicalEntry
canonical form: bun
sense: 07696677-n
part of speech: noun

07696677-n
type: LexicalConcept
in scheme: en-word.net
definition: small rounded bread either plain or sweet
ili: i77320
lexfile: noun.food
part of speech: noun
hypernym: 07695101-n

bankroll-n
type: LexicalEntry
canonical form: bankroll
sense: 13377742-n
part of speech: noun

13377742-n
type: LexicalConcept
in scheme: en-word.net
definition: a roll of currency notes (often taken as the resources of a person or business etc.)
example: he shot his roll on a bob-tailed nag
ili: i106895
lexfile: noun.possession
part of speech: noun
domain topic: 01096649-n
hypernym: 13377127-n

coil-n
type: LexicalEntry
canonical form: coil
sense: 13898609-n
part of speech: noun

whorl-n
type: LexicalEntry
canonical form: whorl
sense: 13898609-n
part of speech: noun

curl-n
type: LexicalEntry
canonical form: curl
sense: 13898609-n
part of speech: noun

curlicue-n
type: LexicalEntry
canonical form: curlicue
sense: 13898609-n
part of speech: noun

ringlet-n
type: LexicalEntry
canonical form: ringlet
sense: 13898609-n
part of speech: noun

gyre-n
type: LexicalEntry
canonical form: gyre
sense: 13898609-n
part of speech: noun

13898609-n
type: LexicalConcept
in scheme: en-word.net
definition: a round shape formed by a series of concentric circles (as formed by leaves or flower petals)
ili: i109847
lexfile: noun.shape
part of speech: noun
hypernym: 13888104-n