launcher-n
type: LexicalEntry
canonical form: launcher
sense: 03652834-n
part of speech: noun

rocket launcher-n
type: LexicalEntry
canonical form: rocket launcher
sense: 03652834-n
part of speech: noun

03652834-n
type: LexicalConcept
in scheme: en-word.net
definition: armament in the form of a device capable of launching a rocket
ili: i55570
lexfile: noun.artifact
part of speech: noun
hypernym: 02741036-n