steamroller-n
type: LexicalEntry
canonical form: steamroller
sense: 04317295-n
part of speech: noun

road roller-n
type: LexicalEntry
canonical form: road roller
sense: 04317295-n
part of speech: noun

04317295-n
type: LexicalConcept
in scheme: en-word.net
definition: vehicle equipped with heavy wide smooth rollers for compacting roads and pavements
ili: i59524
lexfile: noun.artifact
part of speech: noun
hypernym: 04531608-n