road map-n
type: LexicalEntry
canonical form: road map
sense: 04104350-n
part of speech: noun
sense: 05921146-n

04104350-n
type: LexicalConcept
in scheme: en-word.net
definition: a map showing roads (for automobile travel)
ili: i58210
lexfile: noun.artifact
part of speech: noun
domain topic: 02961779-n
hypernym: 03725654-n

guideline-n
type: LexicalEntry
canonical form: guideline
sense: 05921146-n
part of speech: noun

05921146-n
type: LexicalConcept
in scheme: en-word.net
definition: a detailed plan or explanation to guide you in setting standards or determining a course of action
example: the president said he had a road map for normalizing relations with Vietnam
ili: i67910
lexfile: noun.cognition
part of speech: noun
hypernym: 05907175-n
hypernym: 06663446-n