ritual-n
type: LexicalEntry
canonical form: ritual
sense: 00415803-n
part of speech: noun
sense: 01029801-n
sense: 01032852-n

00415803-n
type: LexicalConcept
in scheme: en-word.net
definition: stereotyped behavior
ili: i37581
lexfile: noun.act
part of speech: noun
hypernym: 00415192-n

rite-n
type: LexicalEntry
canonical form: rite
sense: 01029801-n
part of speech: noun

01029801-n
type: LexicalConcept
in scheme: en-word.net
definition: any customary observance or practice
ili: i40786
lexfile: noun.act
part of speech: noun
hypernym: 00414252-n
mero part: 00542516-n

01032852-n
type: LexicalConcept
in scheme: en-word.net
definition: the prescribed procedure for conducting religious ceremonies
ili: i40801
lexfile: noun.act
part of speech: noun
hypernym: 00411260-n

ritual-a
type: LexicalEntry
canonical form: ritual
sense: https://en-word.net/lemma/ritual-a#02903641-a
part of speech: adjective
sense: https://en-word.net/lemma/ritual-a#02903908-a

https://en-word.net/synset/02903641-a
type: LexicalConcept
in scheme: en-word.net
definition: of or relating to or employed in social rites or rituals
example: a ritual dance of Haiti
example: sedate little colonial tribe with its ritual tea parties
  source: Nadine Gordimer
ili: i16456
lexfile: adj.pert
part of speech: adjective

https://en-word.net/synset/02903908-a
type: LexicalConcept
in scheme: en-word.net
definition: of or relating to or characteristic of religious rituals
example: ritual killing
ili: i16457
lexfile: adj.pert
part of speech: adjective