wholly-r
type: LexicalEntry
canonical form: wholly
sense: 00008423-r
part of speech: adverb

entirely-r
type: LexicalEntry
canonical form: entirely
sense: 00008423-r
part of speech: adverb

completely-r
type: LexicalEntry
canonical form: completely
sense: 00008423-r
part of speech: adverb

totally-r
type: LexicalEntry
canonical form: totally
sense: 00008423-r
part of speech: adverb

all-r
type: LexicalEntry
canonical form: all
sense: 00008423-r
part of speech: adverb

altogether-r
type: LexicalEntry
canonical form: altogether
sense: 00008423-r
part of speech: adverb

whole-r
type: LexicalEntry
canonical form: whole
sense: 00008423-r
part of speech: adverb

right-r
type: LexicalEntry
canonical form: right
sense: 00008423-r
part of speech: adverb
sense: 00032793-r
sense: 00058571-r
sense: 00105849-r
sense: 00151409-r
sense: 00197608-r
sense: 00205350-r
sense: 00206480-r
sense: 00206553-r
sense: 00389732-r

00008423-r
type: LexicalConcept
in scheme: en-word.net
definition: to a complete degree or to the full or entire extent; Completely or entirely
example: he was wholly convinced
example: entirely satisfied with the meal
example: it was completely different from what we expected
example: was completely at fault
example: a totally new situation
example: the directions were all wrong
example: it was not altogether her fault
example: an altogether new approach
example: a whole new idea
example: she felt right at home
example: he fell right into the trap
ili: i19554
lexfile: adv.all
part of speech: adverb

veracious-a
type: LexicalEntry
canonical form: veracious
sense: 00023315-s
part of speech: adjective

right-a
type: LexicalEntry
canonical form: right
sense: 00023315-s
part of speech: adjective
sense: 00136526-s
sense: https://en-word.net/lemma/right-a#00634232-a
sense: https://en-word.net/lemma/right-a#00636250-a
sense: 01665754-s
sense: 01682215-s
sense: 01698038-s
sense: 01725165-s
sense: 01885314-s
sense: 01885517-s
sense: 02036425-s
sense: https://en-word.net/lemma/right-a#02037458-a
sense: https://en-word.net/lemma/right-a#02039393-a
sense: https://en-word.net/lemma/right-a#02042235-a
sense: 02089227-s

00023315-s
type: LexicalConcept
in scheme: en-word.net
definition: precisely accurate
example: a veracious account
ili: i110
lexfile: adj.all
part of speech: adjective satellite
similar: https://en-word.net/synset/00021803-a

mighty-r
type: LexicalEntry
canonical form: mighty
sense: 00032793-r
part of speech: adverb

mightily-r
type: LexicalEntry
canonical form: mightily
sense: 00032793-r
part of speech: adverb

powerful-r
type: LexicalEntry
canonical form: powerful
sense: 00032793-r
part of speech: adverb

00032793-r
type: LexicalConcept
in scheme: en-word.net
definition: (Southern regional intensive) very; to a great degree
example: the baby is mighty cute
example: he's mighty tired
example: it is powerful humid
example: that boy is powerful big now
example: they have a right nice place
example: they rejoiced mightily
ili: i18322
lexfile: adv.all
part of speech: adverb
exemplifies: 06332047-n

flop-r
type: LexicalEntry
canonical form: flop
sense: 00058571-r
part of speech: adverb

00058571-r
type: LexicalConcept
in scheme: en-word.net
definition: in a face down manner
example: he fell flop on his face
ili: i18484
lexfile: adv.all
part of speech: adverb
exemplifies: 07089193-n

00105849-r
type: LexicalConcept
in scheme: en-word.net
definition: immediately
example: she called right after dinner
ili: i18800
lexfile: adv.all
part of speech: adverb

proper-a
type: LexicalEntry
canonical form: proper
sense: 00136526-s
part of speech: adjective

00136526-s
type: LexicalConcept
in scheme: en-word.net
definition: appropriate for a condition or purpose or occasion or a person's character, needs
example: everything in its proper place
example: the right man for the job
example: she is not suitable for the position
ili: i724
lexfile: adj.all
part of speech: adjective satellite
similar: https://en-word.net/synset/00135772-a

right on-r
type: LexicalEntry
canonical form: right on
sense: 00151409-r
part of speech: adverb

00151409-r
type: LexicalConcept
in scheme: en-word.net
definition: an interjection expressing agreement; Yes, you are indeed correct
ili: i19147
lexfile: adv.all
part of speech: adverb

properly-r
type: LexicalEntry
canonical form: properly
sense: 00197608-r
part of speech: adverb

decently-r
type: LexicalEntry
canonical form: decently
sense: 00197608-r
part of speech: adverb

decent-r
type: LexicalEntry
canonical form: decent
sense: 00197608-r
part of speech: adverb

00197608-r
type: LexicalConcept
in scheme: en-word.net
definition: in the right manner; correctly; suitably
example: please do your job properly!
example: can't you carry me decent?
ili: i19493
lexfile: adv.all
part of speech: adverb

correct-v
type: LexicalEntry
canonical form: correct
sense: 00200023-v
part of speech: verb
sense: 02525657-v

rectify-v
type: LexicalEntry
canonical form: rectify
sense: 00200023-v
part of speech: verb

right-v
type: LexicalEntry
canonical form: right
sense: 00200023-v
part of speech: verb
sense: 01988588-v
sense: 01988748-v
sense: 02525657-v

00200023-v
type: LexicalConcept
in scheme: en-word.net
definition: make right or correct
example: Correct the mistakes
example: rectify the calculation
ili: i22723
lexfile: verb.change
part of speech: verb
hypernym: 00138328-v

correctly-r
type: LexicalEntry
canonical form: correctly
sense: 00205350-r
part of speech: adverb

aright-r
type: LexicalEntry
canonical form: aright
sense: 00205350-r
part of speech: adverb

00205350-r
type: LexicalConcept
in scheme: en-word.net
definition: in an accurate manner
example: the flower had been correctly depicted by his son
example: he guessed right
ili: i19546
lexfile: adv.all
part of speech: adverb

00206480-r
type: LexicalConcept
in scheme: en-word.net
definition: precisely, exactly
example: stand right here!
ili: i19553
lexfile: adv.all
part of speech: adverb

justly-r
type: LexicalEntry
canonical form: justly
sense: 00206553-r
part of speech: adverb

00206553-r
type: LexicalConcept
in scheme: en-word.net
definition: in accordance with moral or social standards
example: that serves him right
example: do right by him
ili: i19555
lexfile: adv.all
part of speech: adverb

right-n
type: LexicalEntry
canonical form: right
sense: 00351826-n
part of speech: noun
sense: 04098951-n
sense: 04857572-n
sense: 05182180-n
sense: 05572970-n
sense: 08433609-n
sense: 08642648-n
sense: 13362771-n

00351826-n
type: LexicalConcept
in scheme: en-word.net
definition: a turn toward the side of the body that is on the south when the person is facing east
example: take a right at the corner
ili: i37254
lexfile: noun.act
part of speech: noun
hypernym: 00350856-n

00389732-r
type: LexicalConcept
in scheme: en-word.net
definition: toward or on the right; also used figuratively
example: he looked right and left
example: the party has moved right
ili: i20800
lexfile: adv.all
part of speech: adverb

correct-a
type: LexicalEntry
canonical form: correct
sense: https://en-word.net/lemma/correct-a#00634232-a
part of speech: adjective
sense: https://en-word.net/lemma/correct-a#00636250-a
sense: 01885314-s
sense: 01885517-s

https://en-word.net/synset/00634232-a
type: LexicalConcept
in scheme: en-word.net
definition: free from error; especially conforming to fact or truth
example: the correct answer
example: the correct version
example: the right answer
example: took the right road
example: the right decision
ili: i3513
lexfile: adj.all
part of speech: adjective
also: https://en-word.net/synset/00021803-a
also: https://en-word.net/synset/01884565-a
also: https://en-word.net/synset/02469730-a
attribute: 04809447-n
similar: 00634639-s
similar: 00634911-s
similar: 00635146-s

https://en-word.net/synset/00636250-a
type: LexicalConcept
in scheme: en-word.net
definition: correct in opinion or judgment
example: time proved him right
ili: i3521
lexfile: adj.all
part of speech: adjective
similar: 00636421-s

good-a
type: LexicalEntry
canonical form: good
sense: 01665754-s
part of speech: adjective

ripe-a
type: LexicalEntry
canonical form: ripe
sense: 01665754-s
part of speech: adjective

01665754-s
type: LexicalConcept
in scheme: en-word.net
definition: most suitable or right for a particular purpose
example: a good time to plant tomatoes
example: the right time to act
example: the time is ripe for great sociological changes
ili: i9111
lexfile: adj.all
part of speech: adjective satellite
similar: https://en-word.net/synset/01665420-a

one-a
type: LexicalEntry
canonical form: one
sense: 01682215-s
part of speech: adjective

01682215-s
type: LexicalConcept
in scheme: en-word.net
definition: (informal) very; used informally as an intensifier
example: that is one fine dog
example: a right fine day
ili: i9190
lexfile: adj.all
part of speech: adjective satellite
exemplifies: 07089193-n
similar: https://en-word.net/synset/01679784-a

01698038-s
type: LexicalConcept
in scheme: en-word.net
definition: (of the side of cloth or clothing) facing or intended to face outward
example: the right side of the cloth showed the pattern
example: be sure your shirt is right side out
ili: i9271
lexfile: adj.all
part of speech: adjective satellite
similar: https://en-word.net/synset/01697422-a

01725165-s
type: LexicalConcept
in scheme: en-word.net
definition: having the axis perpendicular to the base
example: a right angle
ili: i9438
lexfile: adj.all
part of speech: adjective satellite
domain topic: 06014015-n
similar: https://en-word.net/synset/01724515-a

01885314-s
type: LexicalConcept
in scheme: en-word.net
definition: socially right or correct
example: it isn't right to leave the party without saying goodbye
example: correct behavior
ili: i10313
lexfile: adj.all
part of speech: adjective satellite
similar: https://en-word.net/synset/01884565-a

01885517-s
type: LexicalConcept
in scheme: en-word.net
definition: in accord with accepted standards of usage or procedure
example: what's the right word for this?
example: the right way to open oysters
ili: i10314
lexfile: adj.all
part of speech: adjective satellite
similar: https://en-word.net/synset/01884565-a

01988588-v
type: LexicalConcept
in scheme: en-word.net
definition: regain an upright or proper position
example: The capsized boat righted again
ili: i31658
lexfile: verb.motion
part of speech: verb
hypernym: 01987785-v
similar: 01988748-v

01988748-v
type: LexicalConcept
in scheme: en-word.net
definition: put in or restore to an upright position
example: They righted the sailboat that had capsized
ili: i31659
lexfile: verb.motion
part of speech: verb
hypernym: 00126072-v
similar: 01988588-v

right-hand-a
type: LexicalEntry
canonical form: right-hand
sense: 02036425-s
part of speech: adjective

02036425-s
type: LexicalConcept
in scheme: en-word.net
definition: intended for the right hand
example: a right-hand glove
ili: i11117
lexfile: adj.all
part of speech: adjective satellite
similar: https://en-word.net/synset/02035990-a

https://en-word.net/synset/02037458-a
type: LexicalConcept
in scheme: en-word.net
definition: of or belonging to the political or intellectual right
ili: i11123
lexfile: adj.all
part of speech: adjective
also: https://en-word.net/synset/00576723-a
similar: 02037690-s
similar: 02037803-s
similar: 02037940-s
similar: 02038111-s
similar: 02038200-s

https://en-word.net/synset/02039393-a
type: LexicalConcept
in scheme: en-word.net
definition: being or located on or directed toward the side of the body to the east when facing north
example: my right hand
example: right center field
example: a right-hand turn
example: the right bank of a river is the bank on your right side when you are facing downstream
ili: i11136
lexfile: adj.all
part of speech: adjective
also: https://en-word.net/synset/02035990-a
attribute: 08639173-n
similar: 02039793-s
similar: 02040024-s
similar: 02040137-s
similar: 02040257-s

https://en-word.net/synset/02042235-a
type: LexicalConcept
in scheme: en-word.net
definition: in conformance with justice or law or morality
example: do the right thing and confess
ili: i11153
lexfile: adj.all
part of speech: adjective
also: https://en-word.net/synset/00908608-a
also: https://en-word.net/synset/01133477-a
also: https://en-word.net/synset/01372590-a
also: https://en-word.net/synset/01884565-a
attribute: 04854364-n
similar: 02042493-s

02089227-s
type: LexicalConcept
in scheme: en-word.net
definition: in or into a satisfactory condition
example: things are right again now
example: put things right
ili: i11407
lexfile: adj.all
part of speech: adjective satellite
similar: https://en-word.net/synset/02087716-a

compensate-v
type: LexicalEntry
canonical form: compensate
sense: 02525657-v
part of speech: verb

redress-v
type: LexicalEntry
canonical form: redress
sense: 02525657-v
part of speech: verb

02525657-v
type: LexicalConcept
in scheme: en-word.net
definition: make reparations or amends for
example: right a wrong done to the victims of the Holocaust
ili: i34313
lexfile: verb.social
part of speech: verb
hypernym: 00126072-v

right field-n
type: LexicalEntry
canonical form: right field
sense: 04098951-n
part of speech: noun

rightfield-n
type: LexicalEntry
canonical form: rightfield
sense: 04098951-n
part of speech: noun

04098951-n
type: LexicalConcept
in scheme: en-word.net
definition: the piece of ground in the outfield on the catcher's right
ili: i58179
lexfile: noun.artifact
part of speech: noun
hypernym: 08691133-n

rightfulness-n
type: LexicalEntry
canonical form: rightfulness
sense: 04857572-n
part of speech: noun

04857572-n
type: LexicalConcept
in scheme: en-word.net
definition: anything in accord with principles of justice
example: he feels he is in the right
example: the rightfulness of his claim
ili: i62477
lexfile: noun.attribute
part of speech: noun
hypernym: 04857348-n

05182180-n
type: LexicalConcept
in scheme: en-word.net
definition: an abstract idea of that which is due to a person or governmental body by law or tradition or nature
example: they are endowed by their Creator with certain unalienable Rights
example: Certain rights can never be granted to the government but must be kept in the hands of the people
  source: Eleanor Roosevelt
example: a right is not something that somebody gives you; it is something that nobody can take away
ili: i64172
lexfile: noun.attribute
part of speech: noun
hypernym: 05862715-n

right hand-n
type: LexicalEntry
canonical form: right hand
sense: 05572970-n
part of speech: noun

05572970-n
type: LexicalConcept
in scheme: en-word.net
definition: the hand that is on the right side of the body
example: he writes with his right hand but pitches with his left
example: hit him with quick rights to the body
ili: i66156
lexfile: noun.body
part of speech: noun
hypernym: 05572223-n

right wing-n
type: LexicalEntry
canonical form: right wing
sense: 08433609-n
part of speech: noun

08433609-n
type: LexicalConcept
in scheme: en-word.net
definition: those who support political or social or economic conservatism; those who believe that things are better left unchanged
ili: i81342
lexfile: noun.group
part of speech: noun
hypernym: 08268798-n

08642648-n
type: LexicalConcept
in scheme: en-word.net
definition: location near or direction toward the right side; i.e. the side to the south when a person or object faces east
example: he stood on the right
ili: i82311
lexfile: noun.location
part of speech: noun
hypernym: 08639173-n

13362771-n
type: LexicalConcept
in scheme: en-word.net
definition: (frequently plural) the interest possessed by law or custom in some intangible thing
example: mineral rights
example: film rights
ili: i106818
lexfile: noun.possession
part of speech: noun
exemplifies: 06306016-n
hypernym: 13307824-n