reporter-n
type: LexicalEntry
canonical form: reporter
sense: 10541255-n
part of speech: noun

newsperson-n
type: LexicalEntry
canonical form: newsperson
sense: 10541255-n
part of speech: noun

10541255-n
type: LexicalConcept
in scheme: en-word.net
definition: a person who investigates and reports or edits news stories
ili: i92531
lexfile: noun.person
part of speech: noun
hypernym: 09633690-n